{"text_format":"1","workbook":"xlsx","n_sheets":3,"sheets":["Hoja1","Hoja2","Hoja3"],"not_rendered":{"charts":0,"images":0,"macros":1,"external_links":0,"defined_names":0,"comments":0,"pivot_tables":0},"unopened":[],"bounds":{"document_bytes":16777216,"sheet_cells":100000,"rows_first":2000,"rows_last":500,"rows_between":2000,"halvings":0,"cell_chars":16384,"cell_head_chars":4096},"cells_cut":0,"cells_raw":0,"read":"whole","date_system":"1900"}

{"sheet":"Hoja1","index":0,"n_rows":1004,"n_cols":33,"rows_kept":1004,"cut":false,"hidden":true,"merged":[]}
[null,null,null,null,null,null,null,null,null,null,null,{"$f":"IF(Hoja2!B35=\"\",\"\",VLOOKUP(Hoja2!B35,Hoja1!K5:L50,2,0))","v":""}]
[null,null,null,null,null,null,null,null,null,null,null,{"$f":"IF(Hoja2!B37=\"\",\"\",VLOOKUP(Hoja2!B37,Hoja1!K5:L50,2,0))","v":""},null,null,null,null,{"$f":"MIN(Q5:Q600)","v":0}]
[null,null,null,null,null,null,null,null,null,null,null,{"$f":"IF(Hoja2!B39=\"\",\"\",VLOOKUP(Hoja2!B39,K53:L58,2,0))","v":""},null,null,null,null,{"$f":"MAX(Q5:Q600)","v":0},null,null,null,null,null,null,null,null,null,null,3,4,5,6,7,8]
["NP","JUGADOR/A","EDAT","CLUB","SEXE","rk tot"]
[13267,"SERRET Joan","INF-1","INDEPE","M",7869.24,null,"AECREUS","ASSOC. EXC. CAT. DE REUS",null,"CTT AMICS TERRASSA","AMICS",null,{"$f":"VLOOKUP(C5,$K$60:$L$70,2,0)","v":4},{"$f":"IF($L$3=\"\",1,IF($L$3=0,IF(E5=\"F\",1,0),IF(N5<=$L$3,1,0)))","v":1},null,{"$f":"IF(U5=\"\",\"\",COUNTIF($U$5:$U$600,\"<=\"&$U5))","v":""},{"$f":"IF(Q5=\"\",\"\",Q5-$Q$2+1)","v":""},null,{"$f":"IF(AND($O5=1,OR($L$1=$D5,$L$2=$D5)),A5,\"\")","v":""},{"$f":"IF(AND($O5=1,OR($L$1=$D5,$L$2=$D5)),B5,\"\")","v":""},{"$f":"IF(AND($O5=1,OR($L$1=$D5,$L$2=$D5)),C5,\"\")","v":""},{"$f":"IF(AND($O5=1,OR($L$1=$D5,$L$2=$D5)),D5,\"\")","v":""},{"$f":"IF(AND($O5=1,OR($L$1=$D5,$L$2=$D5)),E5,\"\")","v":""},{"$f":"IF(AND($O5=1,OR($L$1=$D5,$L$2=$D5)),F5,\"\")","v":""},null,{"$f":"AA4+1","v":1},{"$f":"IF(AND($L$1=\"\",$L$2=\"\"),\"\",IF($AA5>$Q$3-$Q$2+1,\"\",VLOOKUP($AA5,$R$5:$Y$600,AB$3,0)))","v":""},"","","","",""]
[13097,"CARDONA Biel","INF-2","CONGRE","M",134.07999999999998,null,"AEVA","AE VALL D'ARAN",null,"CTT ATENEU 1882","ATEN82",null,{"$f":"VLOOKUP(C6,$K$60:$L$70,2,0)","v":4},{"$f":"IF($L$3=\"\",1,IF($L$3=0,IF(E6=\"F\",1,0),IF(N6<=$L$3,1,0)))","v":1},null,"","",null,"","","","","","",null,{"$f":"AA5+1","v":2},"","","","","",""]
[16615,"JIMÉNEZ Cesc","BEN-2","COLLBA","M",26.73,null,"AGRAMU","CTT AGRAMUNT",null,"CTT ATENEU POBLENOU","ATEPN",null,2,1,null,"","",null,"","","","","","",null,3,"","","","","",""]
[16614,"JIMÉNEZ Joan","INF-3","COLLBA","M",185.43000000000004,null,"ALBERA","CTT ALBERA",null,"EUROCLIMA BADALONA","BADALO",null,4,1,null,"","",null,"","","","","","",null,4,"","","","","",""]
[6391,"PAREDES Ferran","INF-2","INDEPE","M",15455.27,null,"ALCARR","CTT ALCARRÀS",null,"CTT CALELLA","CALEL",null,4,1,null,"","",null,"","","","","","",null,5,"","","","","",""]
[14749,"GARCIA Sergi","INF-1","UNIO","M",279.31,null,"ALMOST","CTT ALMOSTER",null,"CTT CARDEDEU","CARDED",null,4,1,null,"","",null,"","","","","","",null,6,"","","","","",""]
{"$rows_left_out":995}
{"sheet":"Hoja2","index":1,"n_rows":265,"n_cols":27,"rows_kept":265,"cut":false,"hidden":false,"merged":[[177,5,177,7],[192,5,192,7],[207,5,207,7],[222,5,222,7],[237,5,237,7],[252,5,252,7],[87,5,87,7],[102,5,102,7],[117,5,117,7],[132,5,132,7],[147,5,147,7],[162,5,162,7],[15,26,17,29],[10,26,12,29],[5,26,7,29],[42,5,42,7],[57,5,57,7],[72,5,72,7],[263,2,263,3],[264,2,264,3],[44,1,44,2],[45,1,45,2],[46,1,46,2],[47,1,47,2],[59,1,59,2],[60,1,60,2],[61,1,61,2],[62,1,62,2],[256,3,256,4],[257,3,257,4],[259,2,259,3],[260,2,260,3],[261,2,261,3],[262,2,262,3],[256,1,256,2],[257,1,257,2],[246,2,246,3],[247,2,247,3],[248,2,248,3],[249,2,249,3],[254,3,254,4],[255,3,255,4],[254,1,254,2],[255,1,255,2],[239,3,239,4],[240,3,240,4],[241,3,241,4],[242,3,242,4],[244,2,244,3],[245,2,245,3],[239,1,239,2],[240,1,240,2],[241,1,241,2],[242,1,242,2],[229,2,229,3],[230,2,230,3],[231,2,231,3],[232,2,232,3],[233,2,233,3],[234,2,234,3],[218,2,218,3],[219,2,219,3],[224,3,224,4],[225,3,225,4],[226,3,226,4],[227,3,227,4],[224,1,224,2],[225,1,225,2],[226,1,226,2],[227,1,227,2],[211,3,211,4],[212,3,212,4],[214,2,214,3],[215,2,215,3],[216,2,216,3],[217,2,217,3],[211,1,211,2],[212,1,212,2],[201,2,201,3],[202,2,202,3],[203,2,203,3],[204,2,204,3],[209,3,209,4],[210,3,210,4],[209,1,209,2],[210,1,210,2],[194,3,194,4],[195,3,195,4],[196,3,196,4],[197,3,197,4],[199,2,199,3],[200,2,200,3],[194,1,194,2],[195,1,195,2],[196,1,196,2],[197,1,197,2],[184,2,184,3],[185,2,185,3],[186,2,186,3],[187,2,187,3],[188,2,188,3],[189,2,189,3],[173,2,173,3],[174,2,174,3],[179,3,179,4],[180,3,180,4],[181,3,181,4],[182,3,182,4],[179,1,179,2],[180,1,180,2],[181,1,181,2],[182,1,182,2],[166,3,166,4],[167,3,167,4],[169,2,169,3],[170,2,170,3],[171,2,171,3],[172,2,172,3],[166,1,166,2],[167,1,167,2],[156,2,156,3],[157,2,157,3],[158,2,158,3],[159,2,159,3],[164,3,164,4],[165,3,165,4],[164,1,164,2],[165,1,165,2],[149,3,149,4],[150,3,150,4],[151,3,151,4],[152,3,152,4],[154,2,154,3],[155,2,155,3],[149,1,149,2],[150,1,150,2],[151,1,151,2],[152,1,152,2],[139,2,139,3],[140,2,140,3],[141,2,141,3],[142,2,142,3],[143,2,143,3],[144,2,144,3],[128,2,128,3],[129,2,129,3],[134,3,134,4],[135,3,135,4],[136,3,136,4],[137,3,137,4],[134,1,134,2],[135,1,135,2],[136,1,136,2],[137,1,137,2],[121,3,121,4],[122,3,122,4],[124,2,124,3],[125,2,125,3],[126,2,126,3],[127,2,127,3],[121,1,121,2],[122,1,122,2],[111,2,111,3],[112,2,112,3],[113,2,113,3],[114,2,114,3],[119,3,119,4],[120,3,120,4],[119,1,119,2],[120,1,120,2],[104,3,104,4],[105,3,105,4],[106,3,106,4],[107,3,107,4],[109,2,109,3],[110,2,110,3],[104,1,104,2],[105,1,105,2],[106,1,106,2],[107,1,107,2],[94,2,94,3],[95,2,95,3],[96,2,96,3],[97,2,97,3],[98,2,98,3],[99,2,99,3],[83,2,83,3],[84,2,84,3],[89,3,89,4],[90,3,90,4],[91,3,91,4],[92,3,92,4],[89,1,89,2],[90,1,90,2],[91,1,91,2],[92,1,92,2],[76,3,76,4],[77,3,77,4],[79,2,79,3],[80,2,80,3],[81,2,81,3],[82,2,82,3],[76,1,76,2],[77,1,77,2],[66,2,66,3],[67,2,67,3],[68,2,68,3],[69,2,69,3],[74,3,74,4],[75,3,75,4],[74,1,74,2],[75,1,75,2],[59,3,59,4],[60,3,60,4],[61,3,61,4],[62,3,62,4],[64,2,64,3],[65,2,65,3],[44,3,44,4],[45,3,45,4],[46,3,46,4],[47,3,47,4],[34,1,34,3],[36,1,36,3],[38,1,38,3],[49,2,49,3],[50,2,50,3],[51,2,51,3],[52,2,52,3],[53,2,53,3],[54,2,54,3]]}
[null,"FORMULARI D'INSCRIPCIÓ PER AL CAMPIONAT DE BARCELONA PER EQUIPS (27 I 28 DE MAIG)"]
[]
[null,"INSTRUCCIONS"]
[null,null,null,null,null,null,null,null,null,null,null,null,null,null,null,null,null,null,null,null,null,null,null,null,null,null,"FA LA INSCRIPCIÓ:"]
[null,"Només ompliu les caselles de color blau, la resta surt automàtic"]
[null,null,null,null,null,null,null,null,null,null,null,null,null,null,null,null,null,null,null,null,null,null,null,null,null,null,{"$f":"IF(B35=\"\",\"\",B35)","v":""}]
[null,"- Ompliu la casella de \"Club que tramet les inscripcions\" escollint un club de la llista desplegable. Assegureu-vos que quan guardeu l'arxiu hi apareix el vostre club, perquè serà"]
[null,"el club que constarà com qui ha fet les inscripcions i, per tant, el club que pagarà les inscripcions (tot i que l'equip estigui composat per integrants de diversos equips)."]
[null,"- Podeu omplir també les caselles \"2n club a introduir per la cerca\" i \"Categoria a omplir per la cerca\", però són opcionals, no tenen cap efecte en les inscripcions, només"]
[null,"serveixen per ampliar o restringir la cerca."]
{"$rows_left_out":256}
{"sheet":"Hoja3","index":2,"n_rows":16,"n_cols":10,"rows_kept":16,"cut":false,"hidden":true,"merged":[]}
[]
[{"$f":"IF(Hoja1!AA5>Hoja1!B$582,\"\",Hoja1!AA5)","v":""},{"$f":"IF(Hoja1!AA5>Hoja1!B$582,\"\",Hoja2!$B$35)","v":""},{"$f":"IF($A2>Hoja1!$B$582,\"\",IF(VLOOKUP($A2,Hoja1!$B$584:$K$598,Hoja1!D$582,0)=\"\",\"\",VLOOKUP($A2,Hoja1!$B$584:$K$598,Hoja1!D$582,0)))","v":""},{"$f":"IF($A2>Hoja1!$B$582,\"\",IF(VLOOKUP($A2,Hoja1!$B$584:$K$598,Hoja1!E$582,0)=\"\",\"\",VLOOKUP($A2,Hoja1!$B$584:$K$598,Hoja1!E$582,0)))","v":""},{"$f":"IF($A2>Hoja1!$B$582,\"\",IF(VLOOKUP($A2,Hoja1!$B$584:$K$598,Hoja1!F$582,0)=\"\",\"\",VLOOKUP($A2,Hoja1!$B$584:$K$598,Hoja1!F$582,0)))","v":""},{"$f":"IF($A2>Hoja1!$B$582,\"\",IF(VLOOKUP($A2,Hoja1!$B$584:$K$598,Hoja1!G$582,0)=\"\",\"\",VLOOKUP($A2,Hoja1!$B$584:$K$598,Hoja1!G$582,0)))","v":""},{"$f":"IF($A2>Hoja1!$B$582,\"\",IF(VLOOKUP($A2,Hoja1!$B$584:$K$598,Hoja1!H$582,0)=\"\",\"\",VLOOKUP($A2,Hoja1!$B$584:$K$598,Hoja1!H$582,0)))","v":""},{"$f":"IF($A2>Hoja1!$B$582,\"\",IF(VLOOKUP($A2,Hoja1!$B$584:$K$598,Hoja1!I$582,0)=\"\",\"\",VLOOKUP($A2,Hoja1!$B$584:$K$598,Hoja1!I$582,0)))","v":""},{"$f":"IF($A2>Hoja1!$B$582,\"\",IF(VLOOKUP($A2,Hoja1!$B$584:$K$598,Hoja1!J$582,0)=\"\",\"\",VLOOKUP($A2,Hoja1!$B$584:$K$598,Hoja1!J$582,0)))","v":""},{"$f":"IF($A2>Hoja1!$B$582,\"\",IF(VLOOKUP($A2,Hoja1!$B$584:$K$598,Hoja1!K$582,0)=\"\",\"\",VLOOKUP($A2,Hoja1!$B$584:$K$598,Hoja1!K$582,0)))","v":""}]
[{"$f":"IF(Hoja1!AA6>Hoja1!B$582,\"\",Hoja1!AA6)","v":""},{"$f":"IF(Hoja1!AA6>Hoja1!B$582,\"\",Hoja2!$B$35)","v":""},{"$f":"IF($A3>Hoja1!$B$582,\"\",IF(VLOOKUP($A3,Hoja1!$B$584:$K$598,Hoja1!D$582,0)=\"\",\"\",VLOOKUP($A3,Hoja1!$B$584:$K$598,Hoja1!D$582,0)))","v":""},{"$f":"IF($A3>Hoja1!$B$582,\"\",IF(VLOOKUP($A3,Hoja1!$B$584:$K$598,Hoja1!E$582,0)=\"\",\"\",VLOOKUP($A3,Hoja1!$B$584:$K$598,Hoja1!E$582,0)))","v":""},{"$f":"IF($A3>Hoja1!$B$582,\"\",IF(VLOOKUP($A3,Hoja1!$B$584:$K$598,Hoja1!F$582,0)=\"\",\"\",VLOOKUP($A3,Hoja1!$B$584:$K$598,Hoja1!F$582,0)))","v":""},{"$f":"IF($A3>Hoja1!$B$582,\"\",IF(VLOOKUP($A3,Hoja1!$B$584:$K$598,Hoja1!G$582,0)=\"\",\"\",VLOOKUP($A3,Hoja1!$B$584:$K$598,Hoja1!G$582,0)))","v":""},{"$f":"IF($A3>Hoja1!$B$582,\"\",IF(VLOOKUP($A3,Hoja1!$B$584:$K$598,Hoja1!H$582,0)=\"\",\"\",VLOOKUP($A3,Hoja1!$B$584:$K$598,Hoja1!H$582,0)))","v":""},{"$f":"IF($A3>Hoja1!$B$582,\"\",IF(VLOOKUP($A3,Hoja1!$B$584:$K$598,Hoja1!I$582,0)=\"\",\"\",VLOOKUP($A3,Hoja1!$B$584:$K$598,Hoja1!I$582,0)))","v":""},{"$f":"IF($A3>Hoja1!$B$582,\"\",IF(VLOOKUP($A3,Hoja1!$B$584:$K$598,Hoja1!J$582,0)=\"\",\"\",VLOOKUP($A3,Hoja1!$B$584:$K$598,Hoja1!J$582,0)))","v":""},{"$f":"IF($A3>Hoja1!$B$582,\"\",IF(VLOOKUP($A3,Hoja1!$B$584:$K$598,Hoja1!K$582,0)=\"\",\"\",VLOOKUP($A3,Hoja1!$B$584:$K$598,Hoja1!K$582,0)))","v":""}]
[{"$f":"IF(Hoja1!AA7>Hoja1!B$582,\"\",Hoja1!AA7)","v":""},{"$f":"IF(Hoja1!AA7>Hoja1!B$582,\"\",Hoja2!$B$35)","v":""},{"$f":"IF($A4>Hoja1!$B$582,\"\",IF(VLOOKUP($A4,Hoja1!$B$584:$K$598,Hoja1!D$582,0)=\"\",\"\",VLOOKUP($A4,Hoja1!$B$584:$K$598,Hoja1!D$582,0)))","v":""},{"$f":"IF($A4>Hoja1!$B$582,\"\",IF(VLOOKUP($A4,Hoja1!$B$584:$K$598,Hoja1!E$582,0)=\"\",\"\",VLOOKUP($A4,Hoja1!$B$584:$K$598,Hoja1!E$582,0)))","v":""},{"$f":"IF($A4>Hoja1!$B$582,\"\",IF(VLOOKUP($A4,Hoja1!$B$584:$K$598,Hoja1!F$582,0)=\"\",\"\",VLOOKUP($A4,Hoja1!$B$584:$K$598,Hoja1!F$582,0)))","v":""},{"$f":"IF($A4>Hoja1!$B$582,\"\",IF(VLOOKUP($A4,Hoja1!$B$584:$K$598,Hoja1!G$582,0)=\"\",\"\",VLOOKUP($A4,Hoja1!$B$584:$K$598,Hoja1!G$582,0)))","v":""},{"$f":"IF($A4>Hoja1!$B$582,\"\",IF(VLOOKUP($A4,Hoja1!$B$584:$K$598,Hoja1!H$582,0)=\"\",\"\",VLOOKUP($A4,Hoja1!$B$584:$K$598,Hoja1!H$582,0)))","v":""},{"$f":"IF($A4>Hoja1!$B$582,\"\",IF(VLOOKUP($A4,Hoja1!$B$584:$K$598,Hoja1!I$582,0)=\"\",\"\",VLOOKUP($A4,Hoja1!$B$584:$K$598,Hoja1!I$582,0)))","v":""},{"$f":"IF($A4>Hoja1!$B$582,\"\",IF(VLOOKUP($A4,Hoja1!$B$584:$K$598,Hoja1!J$582,0)=\"\",\"\",VLOOKUP($A4,Hoja1!$B$584:$K$598,Hoja1!J$582,0)))","v":""},{"$f":"IF($A4>Hoja1!$B$582,\"\",IF(VLOOKUP($A4,Hoja1!$B$584:$K$598,Hoja1!K$582,0)=\"\",\"\",VLOOKUP($A4,Hoja1!$B$584:$K$598,Hoja1!K$582,0)))","v":""}]
[{"$f":"IF(Hoja1!AA8>Hoja1!B$582,\"\",Hoja1!AA8)","v":""},{"$f":"IF(Hoja1!AA8>Hoja1!B$582,\"\",Hoja2!$B$35)","v":""},{"$f":"IF($A5>Hoja1!$B$582,\"\",IF(VLOOKUP($A5,Hoja1!$B$584:$K$598,Hoja1!D$582,0)=\"\",\"\",VLOOKUP($A5,Hoja1!$B$584:$K$598,Hoja1!D$582,0)))","v":""},{"$f":"IF($A5>Hoja1!$B$582,\"\",IF(VLOOKUP($A5,Hoja1!$B$584:$K$598,Hoja1!E$582,0)=\"\",\"\",VLOOKUP($A5,Hoja1!$B$584:$K$598,Hoja1!E$582,0)))","v":""},{"$f":"IF($A5>Hoja1!$B$582,\"\",IF(VLOOKUP($A5,Hoja1!$B$584:$K$598,Hoja1!F$582,0)=\"\",\"\",VLOOKUP($A5,Hoja1!$B$584:$K$598,Hoja1!F$582,0)))","v":""},{"$f":"IF($A5>Hoja1!$B$582,\"\",IF(VLOOKUP($A5,Hoja1!$B$584:$K$598,Hoja1!G$582,0)=\"\",\"\",VLOOKUP($A5,Hoja1!$B$584:$K$598,Hoja1!G$582,0)))","v":""},{"$f":"IF($A5>Hoja1!$B$582,\"\",IF(VLOOKUP($A5,Hoja1!$B$584:$K$598,Hoja1!H$582,0)=\"\",\"\",VLOOKUP($A5,Hoja1!$B$584:$K$598,Hoja1!H$582,0)))","v":""},{"$f":"IF($A5>Hoja1!$B$582,\"\",IF(VLOOKUP($A5,Hoja1!$B$584:$K$598,Hoja1!I$582,0)=\"\",\"\",VLOOKUP($A5,Hoja1!$B$584:$K$598,Hoja1!I$582,0)))","v":""},{"$f":"IF($A5>Hoja1!$B$582,\"\",IF(VLOOKUP($A5,Hoja1!$B$584:$K$598,Hoja1!J$582,0)=\"\",\"\",VLOOKUP($A5,Hoja1!$B$584:$K$598,Hoja1!J$582,0)))","v":""},{"$f":"IF($A5>Hoja1!$B$582,\"\",IF(VLOOKUP($A5,Hoja1!$B$584:$K$598,Hoja1!K$582,0)=\"\",\"\",VLOOKUP($A5,Hoja1!$B$584:$K$598,Hoja1!K$582,0)))","v":""}]
[{"$f":"IF(Hoja1!AA9>Hoja1!B$582,\"\",Hoja1!AA9)","v":""},{"$f":"IF(Hoja1!AA9>Hoja1!B$582,\"\",Hoja2!$B$35)","v":""},{"$f":"IF($A6>Hoja1!$B$582,\"\",IF(VLOOKUP($A6,Hoja1!$B$584:$K$598,Hoja1!D$582,0)=\"\",\"\",VLOOKUP($A6,Hoja1!$B$584:$K$598,Hoja1!D$582,0)))","v":""},{"$f":"IF($A6>Hoja1!$B$582,\"\",IF(VLOOKUP($A6,Hoja1!$B$584:$K$598,Hoja1!E$582,0)=\"\",\"\",VLOOKUP($A6,Hoja1!$B$584:$K$598,Hoja1!E$582,0)))","v":""},{"$f":"IF($A6>Hoja1!$B$582,\"\",IF(VLOOKUP($A6,Hoja1!$B$584:$K$598,Hoja1!F$582,0)=\"\",\"\",VLOOKUP($A6,Hoja1!$B$584:$K$598,Hoja1!F$582,0)))","v":""},{"$f":"IF($A6>Hoja1!$B$582,\"\",IF(VLOOKUP($A6,Hoja1!$B$584:$K$598,Hoja1!G$582,0)=\"\",\"\",VLOOKUP($A6,Hoja1!$B$584:$K$598,Hoja1!G$582,0)))","v":""},{"$f":"IF($A6>Hoja1!$B$582,\"\",IF(VLOOKUP($A6,Hoja1!$B$584:$K$598,Hoja1!H$582,0)=\"\",\"\",VLOOKUP($A6,Hoja1!$B$584:$K$598,Hoja1!H$582,0)))","v":""},{"$f":"IF($A6>Hoja1!$B$582,\"\",IF(VLOOKUP($A6,Hoja1!$B$584:$K$598,Hoja1!I$582,0)=\"\",\"\",VLOOKUP($A6,Hoja1!$B$584:$K$598,Hoja1!I$582,0)))","v":""},{"$f":"IF($A6>Hoja1!$B$582,\"\",IF(VLOOKUP($A6,Hoja1!$B$584:$K$598,Hoja1!J$582,0)=\"\",\"\",VLOOKUP($A6,Hoja1!$B$584:$K$598,Hoja1!J$582,0)))","v":""},{"$f":"IF($A6>Hoja1!$B$582,\"\",IF(VLOOKUP($A6,Hoja1!$B$584:$K$598,Hoja1!K$582,0)=\"\",\"\",VLOOKUP($A6,Hoja1!$B$584:$K$598,Hoja1!K$582,0)))","v":""}]
[{"$f":"IF(Hoja1!AA10>Hoja1!B$582,\"\",Hoja1!AA10)","v":""},{"$f":"IF(Hoja1!AA10>Hoja1!B$582,\"\",Hoja2!$B$35)","v":""},{"$f":"IF($A7>Hoja1!$B$582,\"\",IF(VLOOKUP($A7,Hoja1!$B$584:$K$598,Hoja1!D$582,0)=\"\",\"\",VLOOKUP($A7,Hoja1!$B$584:$K$598,Hoja1!D$582,0)))","v":""},{"$f":"IF($A7>Hoja1!$B$582,\"\",IF(VLOOKUP($A7,Hoja1!$B$584:$K$598,Hoja1!E$582,0)=\"\",\"\",VLOOKUP($A7,Hoja1!$B$584:$K$598,Hoja1!E$582,0)))","v":""},{"$f":"IF($A7>Hoja1!$B$582,\"\",IF(VLOOKUP($A7,Hoja1!$B$584:$K$598,Hoja1!F$582,0)=\"\",\"\",VLOOKUP($A7,Hoja1!$B$584:$K$598,Hoja1!F$582,0)))","v":""},{"$f":"IF($A7>Hoja1!$B$582,\"\",IF(VLOOKUP($A7,Hoja1!$B$584:$K$598,Hoja1!G$582,0)=\"\",\"\",VLOOKUP($A7,Hoja1!$B$584:$K$598,Hoja1!G$582,0)))","v":""},{"$f":"IF($A7>Hoja1!$B$582,\"\",IF(VLOOKUP($A7,Hoja1!$B$584:$K$598,Hoja1!H$582,0)=\"\",\"\",VLOOKUP($A7,Hoja1!$B$584:$K$598,Hoja1!H$582,0)))","v":""},{"$f":"IF($A7>Hoja1!$B$582,\"\",IF(VLOOKUP($A7,Hoja1!$B$584:$K$598,Hoja1!I$582,0)=\"\",\"\",VLOOKUP($A7,Hoja1!$B$584:$K$598,Hoja1!I$582,0)))","v":""},{"$f":"IF($A7>Hoja1!$B$582,\"\",IF(VLOOKUP($A7,Hoja1!$B$584:$K$598,Hoja1!J$582,0)=\"\",\"\",VLOOKUP($A7,Hoja1!$B$584:$K$598,Hoja1!J$582,0)))","v":""},{"$f":"IF($A7>Hoja1!$B$582,\"\",IF(VLOOKUP($A7,Hoja1!$B$584:$K$598,Hoja1!K$582,0)=\"\",\"\",VLOOKUP($A7,Hoja1!$B$584:$K$598,Hoja1!K$582,0)))","v":""}]
[{"$f":"IF(Hoja1!AA11>Hoja1!B$582,\"\",Hoja1!AA11)","v":""},{"$f":"IF(Hoja1!AA11>Hoja1!B$582,\"\",Hoja2!$B$35)","v":""},{"$f":"IF($A8>Hoja1!$B$582,\"\",IF(VLOOKUP($A8,Hoja1!$B$584:$K$598,Hoja1!D$582,0)=\"\",\"\",VLOOKUP($A8,Hoja1!$B$584:$K$598,Hoja1!D$582,0)))","v":""},{"$f":"IF($A8>Hoja1!$B$582,\"\",IF(VLOOKUP($A8,Hoja1!$B$584:$K$598,Hoja1!E$582,0)=\"\",\"\",VLOOKUP($A8,Hoja1!$B$584:$K$598,Hoja1!E$582,0)))","v":""},{"$f":"IF($A8>Hoja1!$B$582,\"\",IF(VLOOKUP($A8,Hoja1!$B$584:$K$598,Hoja1!F$582,0)=\"\",\"\",VLOOKUP($A8,Hoja1!$B$584:$K$598,Hoja1!F$582,0)))","v":""},{"$f":"IF($A8>Hoja1!$B$582,\"\",IF(VLOOKUP($A8,Hoja1!$B$584:$K$598,Hoja1!G$582,0)=\"\",\"\",VLOOKUP($A8,Hoja1!$B$584:$K$598,Hoja1!G$582,0)))","v":""},{"$f":"IF($A8>Hoja1!$B$582,\"\",IF(VLOOKUP($A8,Hoja1!$B$584:$K$598,Hoja1!H$582,0)=\"\",\"\",VLOOKUP($A8,Hoja1!$B$584:$K$598,Hoja1!H$582,0)))","v":""},{"$f":"IF($A8>Hoja1!$B$582,\"\",IF(VLOOKUP($A8,Hoja1!$B$584:$K$598,Hoja1!I$582,0)=\"\",\"\",VLOOKUP($A8,Hoja1!$B$584:$K$598,Hoja1!I$582,0)))","v":""},{"$f":"IF($A8>Hoja1!$B$582,\"\",IF(VLOOKUP($A8,Hoja1!$B$584:$K$598,Hoja1!J$582,0)=\"\",\"\",VLOOKUP($A8,Hoja1!$B$584:$K$598,Hoja1!J$582,0)))","v":""},{"$f":"IF($A8>Hoja1!$B$582,\"\",IF(VLOOKUP($A8,Hoja1!$B$584:$K$598,Hoja1!K$582,0)=\"\",\"\",VLOOKUP($A8,Hoja1!$B$584:$K$598,Hoja1!K$582,0)))","v":""}]
[{"$f":"IF(Hoja1!AA12>Hoja1!B$582,\"\",Hoja1!AA12)","v":""},{"$f":"IF(Hoja1!AA12>Hoja1!B$582,\"\",Hoja2!$B$35)","v":""},{"$f":"IF($A9>Hoja1!$B$582,\"\",IF(VLOOKUP($A9,Hoja1!$B$584:$K$598,Hoja1!D$582,0)=\"\",\"\",VLOOKUP($A9,Hoja1!$B$584:$K$598,Hoja1!D$582,0)))","v":""},{"$f":"IF($A9>Hoja1!$B$582,\"\",IF(VLOOKUP($A9,Hoja1!$B$584:$K$598,Hoja1!E$582,0)=\"\",\"\",VLOOKUP($A9,Hoja1!$B$584:$K$598,Hoja1!E$582,0)))","v":""},{"$f":"IF($A9>Hoja1!$B$582,\"\",IF(VLOOKUP($A9,Hoja1!$B$584:$K$598,Hoja1!F$582,0)=\"\",\"\",VLOOKUP($A9,Hoja1!$B$584:$K$598,Hoja1!F$582,0)))","v":""},{"$f":"IF($A9>Hoja1!$B$582,\"\",IF(VLOOKUP($A9,Hoja1!$B$584:$K$598,Hoja1!G$582,0)=\"\",\"\",VLOOKUP($A9,Hoja1!$B$584:$K$598,Hoja1!G$582,0)))","v":""},{"$f":"IF($A9>Hoja1!$B$582,\"\",IF(VLOOKUP($A9,Hoja1!$B$584:$K$598,Hoja1!H$582,0)=\"\",\"\",VLOOKUP($A9,Hoja1!$B$584:$K$598,Hoja1!H$582,0)))","v":""},{"$f":"IF($A9>Hoja1!$B$582,\"\",IF(VLOOKUP($A9,Hoja1!$B$584:$K$598,Hoja1!I$582,0)=\"\",\"\",VLOOKUP($A9,Hoja1!$B$584:$K$598,Hoja1!I$582,0)))","v":""},{"$f":"IF($A9>Hoja1!$B$582,\"\",IF(VLOOKUP($A9,Hoja1!$B$584:$K$598,Hoja1!J$582,0)=\"\",\"\",VLOOKUP($A9,Hoja1!$B$584:$K$598,Hoja1!J$582,0)))","v":""},{"$f":"IF($A9>Hoja1!$B$582,\"\",IF(VLOOKUP($A9,Hoja1!$B$584:$K$598,Hoja1!K$582,0)=\"\",\"\",VLOOKUP($A9,Hoja1!$B$584:$K$598,Hoja1!K$582,0)))","v":""}]
[{"$f":"IF(Hoja1!AA13>Hoja1!B$582,\"\",Hoja1!AA13)","v":""},{"$f":"IF(Hoja1!AA13>Hoja1!B$582,\"\",Hoja2!$B$35)","v":""},{"$f":"IF($A10>Hoja1!$B$582,\"\",IF(VLOOKUP($A10,Hoja1!$B$584:$K$598,Hoja1!D$582,0)=\"\",\"\",VLOOKUP($A10,Hoja1!$B$584:$K$598,Hoja1!D$582,0)))","v":""},{"$f":"IF($A10>Hoja1!$B$582,\"\",IF(VLOOKUP($A10,Hoja1!$B$584:$K$598,Hoja1!E$582,0)=\"\",\"\",VLOOKUP($A10,Hoja1!$B$584:$K$598,Hoja1!E$582,0)))","v":""},{"$f":"IF($A10>Hoja1!$B$582,\"\",IF(VLOOKUP($A10,Hoja1!$B$584:$K$598,Hoja1!F$582,0)=\"\",\"\",VLOOKUP($A10,Hoja1!$B$584:$K$598,Hoja1!F$582,0)))","v":""},{"$f":"IF($A10>Hoja1!$B$582,\"\",IF(VLOOKUP($A10,Hoja1!$B$584:$K$598,Hoja1!G$582,0)=\"\",\"\",VLOOKUP($A10,Hoja1!$B$584:$K$598,Hoja1!G$582,0)))","v":""},{"$f":"IF($A10>Hoja1!$B$582,\"\",IF(VLOOKUP($A10,Hoja1!$B$584:$K$598,Hoja1!H$582,0)=\"\",\"\",VLOOKUP($A10,Hoja1!$B$584:$K$598,Hoja1!H$582,0)))","v":""},{"$f":"IF($A10>Hoja1!$B$582,\"\",IF(VLOOKUP($A10,Hoja1!$B$584:$K$598,Hoja1!I$582,0)=\"\",\"\",VLOOKUP($A10,Hoja1!$B$584:$K$598,Hoja1!I$582,0)))","v":""},{"$f":"IF($A10>Hoja1!$B$582,\"\",IF(VLOOKUP($A10,Hoja1!$B$584:$K$598,Hoja1!J$582,0)=\"\",\"\",VLOOKUP($A10,Hoja1!$B$584:$K$598,Hoja1!J$582,0)))","v":""},{"$f":"IF($A10>Hoja1!$B$582,\"\",IF(VLOOKUP($A10,Hoja1!$B$584:$K$598,Hoja1!K$582,0)=\"\",\"\",VLOOKUP($A10,Hoja1!$B$584:$K$598,Hoja1!K$582,0)))","v":""}]
{"$rows_left_out":6}