{"text_format":"1","workbook":"xlsx","n_sheets":3,"sheets":["Hoja1","Hoja2","Hoja3"],"not_rendered":{"charts":0,"images":0,"macros":1,"external_links":0,"defined_names":0,"comments":0,"pivot_tables":0},"unopened":[],"bounds":{"document_bytes":16777216,"sheet_cells":100000,"rows_first":2000,"rows_last":500,"rows_between":2000,"halvings":0,"cell_chars":16384,"cell_head_chars":4096},"cells_cut":0,"cells_raw":0,"read":"whole","date_system":"1900"}

{"sheet":"Hoja1","index":0,"n_rows":1004,"n_cols":33,"rows_kept":1004,"cut":false,"hidden":true,"merged":[]}
[null,null,null,null,null,null,null,null,null,null,null,{"$f":"IF(Hoja2!B35=\"\",\"\",VLOOKUP(Hoja2!B35,Hoja1!K5:L50,2,0))","v":""}]
[null,null,null,null,null,null,null,null,null,null,null,{"$f":"IF(Hoja2!B37=\"\",\"\",VLOOKUP(Hoja2!B37,Hoja1!K5:L50,2,0))","v":""},null,null,null,null,{"$f":"MIN(Q5:Q600)","v":0}]
[null,null,null,null,null,null,null,null,null,null,null,{"$f":"IF(Hoja2!B39=\"\",\"\",VLOOKUP(Hoja2!B39,K53:L58,2,0))","v":""},null,null,null,null,{"$f":"MAX(Q5:Q600)","v":0},null,null,null,null,null,null,null,null,null,null,3,4,5,6,7,8]
["NP","JUGADOR/A","EDAT","CLUB","SEXE","rk tot"]
[13267,"SERRET Joan","INF-1","INDEPE","M",7869.24,null,"AECREUS","ASSOC. EXC. CAT. DE REUS",null,"CTT AMICS TERRASSA","AMICS",null,{"$f":"VLOOKUP(C5,$K$60:$L$70,2,0)","v":4},{"$f":"IF($L$3=\"\",1,IF($L$3=0,IF(E5=\"F\",1,0),IF(N5<=$L$3,1,0)))","v":1},null,{"$f":"IF(U5=\"\",\"\",COUNTIF($U$5:$U$600,\"<=\"&$U5))","v":""},{"$f":"IF(Q5=\"\",\"\",Q5-$Q$2+1)","v":""},null,{"$f":"IF(AND($O5=1,OR($L$1=$D5,$L$2=$D5)),A5,\"\")","v":""},{"$f":"IF(AND($O5=1,OR($L$1=$D5,$L$2=$D5)),B5,\"\")","v":""},{"$f":"IF(AND($O5=1,OR($L$1=$D5,$L$2=$D5)),C5,\"\")","v":""},{"$f":"IF(AND($O5=1,OR($L$1=$D5,$L$2=$D5)),D5,\"\")","v":""},{"$f":"IF(AND($O5=1,OR($L$1=$D5,$L$2=$D5)),E5,\"\")","v":""},{"$f":"IF(AND($O5=1,OR($L$1=$D5,$L$2=$D5)),F5,\"\")","v":""},null,{"$f":"AA4+1","v":1},{"$f":"IF(AND($L$1=\"\",$L$2=\"\"),\"\",IF($AA5>$Q$3-$Q$2+1,\"\",VLOOKUP($AA5,$R$5:$Y$600,AB$3,0)))","v":""},"","","","",""]
[13097,"CARDONA Biel","INF-2","CONGRE","M",134.07999999999998,null,"AEVA","AE VALL D'ARAN",null,"CTT ATENEU 1882","ATEN82",null,{"$f":"VLOOKUP(C6,$K$60:$L$70,2,0)","v":4},{"$f":"IF($L$3=\"\",1,IF($L$3=0,IF(E6=\"F\",1,0),IF(N6<=$L$3,1,0)))","v":1},null,"","",null,"","","","","","",null,{"$f":"AA5+1","v":2},"","","","","",""]
[16615,"JIMÉNEZ Cesc","BEN-2","COLLBA","M",26.73,null,"AGRAMU","CTT AGRAMUNT",null,"CTT ATENEU POBLENOU","ATEPN",null,2,1,null,"","",null,"","","","","","",null,3,"","","","","",""]
[16614,"JIMÉNEZ Joan","INF-3","COLLBA","M",185.43000000000004,null,"ALBERA","CTT ALBERA",null,"EUROCLIMA BADALONA","BADALO",null,4,1,null,"","",null,"","","","","","",null,4,"","","","","",""]
[6391,"PAREDES Ferran","INF-2","INDEPE","M",15455.27,null,"ALCARR","CTT ALCARRÀS",null,"CTT CALELLA","CALEL",null,4,1,null,"","",null,"","","","","","",null,5,"","","","","",""]
[14749,"GARCIA Sergi","INF-1","UNIO","M",279.31,null,"ALMOST","CTT ALMOSTER",null,"CTT CARDEDEU","CARDED",null,4,1,null,"","",null,"","","","","","",null,6,"","","","","",""]
[14750,"SEVILLA Marc","INF-1","UNIO","M",563.29999999999995,null,"AMICS","CTT AMICS TERRASSA",null,"CTT CASTELLDEFELS","CASTDF",null,4,1,null,"","",null,"","","","","","",null,7,"","","","","",""]
[15156,"MATURANA Isaac","ALE-2","UNIO","M",93.37,null,"AMPOST","CTT AMPOSTA",null,"CN SABADELL","CNSABA",null,3,1,null,"","",null,"","","","","","",null,8,"","","","","",""]
[15159,"MUÑOZ David","ALE-2","UNIO","M",220.82,null,"ARBUCI","CTT ARBUCIES",null,"CTT COLLBATO","COLLBA",null,3,1,null,"","",null,"","","","","","",null,9,"","","","","",""]
[14340,"BOFILL Aniol","ALE-2","UNIO","M",155.60000000000002,null,"ARIEL","CLUB ARIEL",null,"AGRUPACIÓ CONGRÉS","CONGRE",null,3,1,null,"","",null,"","","","","","",null,10,"","","","","",""]
[16356,"VERA Ferran","BEN-2","VILANO","M",8.52,null,"ATEN82","CTT ATENEU 1882",null,"CTT CASTELLGALÍ","CTGALI",null,2,1,null,"","",null,"","","","","","",null,11,{"$f":"IF(AND($L$1=\"\",$L$2=\"\"),\"\",IF($AA15>$Q$3-$Q$2+1,\"\",VLOOKUP($AA15,$R$5:$Y$600,AB$3,0)))","v":""},"","","","",""]
[16345,"ALVAREZ Iker","ALE-2","VILANO","M",17.28,null,"ATEPN","CTT ATENEU POBLENOU",null,"ATT CASTELLAR","CTLLAR",null,3,1,null,"","",null,"","","","","","",null,12,"","","","","",""]
[15940,"GARCIA Raul","INF-2","VILANO","M",62.53,null,"AVAP","AVAP",null,"CTT BARCELONA","CTTBCN",null,4,1,null,"","",null,"","","","","","",null,13,"","","","","",""]
[16323,"ALCANTUD Pau","INF-1","VILANO","M",0,null,"AVENÇ","CTT L'AVENÇ",null,"ICELAND ELS 8","ELS 8",null,4,1,null,"","",null,"","","","","","",null,14,"","","","","",""]
[16618,"FERNANDEZ Hugo","BEN-1","VILANO","M",10.78,null,"BADALO","EUROCLIMA BADALONA",null,"CETT ESPARREGUERA","ESPARR",null,2,1,null,"","",null,"","","","","","",null,15,"","","","","",""]
[15253,"PEREGRINA Antoni","INF-1","VILANO","M",117.25,null,"BALAGU","CTT BALAGUER",null,"CLUB FALCONS SABADELL AE","FALCO",null,4,1,null,"","",null,"","","","","","",null,16,"","","","","",""]
[14420,"LOPEZ Victor","INF-1","VILANO","M",52.71,null,"BARCIN","CT BARCINO",null,"CTT GRANOLLERS","GRANO",null,4,1,null,"","",null,"","","","","","",null,17,"","","","","",""]
[14418,"PANOSA Bernat","BEN-1","VILANO","M",724.33999999999992,null,"BASCA","CTT BÀSCARA",null,"TT L'HOSPITALET","HOSPIT",null,2,1,null,"","",null,"","","","","","",null,18,"","","","","",""]
[14270,"MARTINEZ Daniel","INF-2","VILANO","M",558.53000000000009,null,"BELLVI","BELLVITGE ALHEÑA",null,"CPP IGUALADA","IGUALA",null,4,1,null,"","",null,"","","","","","",null,19,"","","","","",""]
[12654,"DIPOLLINA Giulia","INF-3","VILANO","F",1509.1200000000001,null,"BISBAL","CTT LA BISBAL",null,"INDEPENDENT","INDEPE",null,4,1,null,"","",null,"","","","","","",null,20,"","","","","",""]
[12719,"JIMENEZ Alvaro","INF-3","VILANO","M",2614.2800000000002,null,"BORGES","CTT BORGES",null,"ELS JOVES TT CASTELLDEFELS","JOVCTDF",null,4,1,null,"","",null,"","","","","","",null,21,{"$f":"IF(AND($L$1=\"\",$L$2=\"\"),\"\",IF($AA25>$Q$3-$Q$2+1,\"\",VLOOKUP($AA25,$R$5:$Y$600,AB$3,0)))","v":""},"","","","",""]
[16543,"RAFAEL Unai","ALE-1","VILANO","M",4.5599999999999996,null,"CAIXA","AP LA CAIXA",null,"LLUÏSOS DE GRÀCIA","LLUÏSO",null,3,1,null,"","",null,"","","","","","",null,22,"","","","","",""]
[16706,"GONZALEZ Bruno","INF-1","VILANO","M",26.13,null,"CALAF","CTT CALAF",null,"MASQUEFA TTC","MASQUE",null,4,1,null,"","",null,"","","","","","",null,23,"","","","","",""]
[16617,"CARANDELL Ferran","ALE-1","VILANO","M",10.56,null,"CALDES","CN CALDES",null,"CN MATARÓ","MATARO",null,3,1,null,"","",null,"","","","","","",null,24,"","","","","",""]
[15968,"ALONSO Ruben","BEN-1","JOVCTDF","M",3.3600000000000003,null,"CALEL","CTT CALELLA",null,"CTT ATC MOLINS DE REI","MOLINS",null,2,1,null,"","",null,"","","","","","",null,25,"","","","","",""]
[13535,"BENAVENT Nil","INF-3","JOVCTDF","M",6007.71,null,"CAMBRI","CTT CAMBRILS OLEASTRUM",null,"MOLLET 2002 TT","MOLLET",null,4,1,null,"","",null,"","","","","","",null,26,"","","","","",""]
[14526,"COMAS Jan","BEN-1","INDEPE","M",629.26,null,"CAMPLL","CTT CAMPLLONG",null,"CTT OLESA","OLESA",null,2,1,null,"","",null,"","","","","","",null,27,"","","","","",""]
[15287,"ORDÓÑEZ Joel","ALE-2","JOVCTDF","M",882.18000000000006,null,"CAMPRO","CTT CAMPRODON",null,"CTT JOSEP M. PALES","PALES",null,3,1,null,"","",null,"","","","","","",null,28,"","","","","",""]
[12395,"MARTÍN Aleix","INF-1","JOVCTDF","M",2220.14,null,"CANET","CTT CANET DE MAR",null,"TT PARETS","PARETS",null,4,1,null,"","",null,"","","","","","",null,29,"","","","","",""]
[16700,"VARGAS Ignacio","ALE-2","JOVCTDF","M",40.730000000000004,null,"CARDED","CTT CARDEDEU",null,"ATT PREMIÀ DE MAR","PREMIA",null,3,1,null,"","",null,"","","","","","",null,30,"","","","","",""]
[15835,"BOCHACA Kai","INF-1","JOVCTDF","M",215.45999999999998,null,"CASTDF","CTT CASTELLDEFELS",null,"CTT SANT QUIRZE DEL VALLÈS","QUIRZ",null,4,1,null,"","",null,"","","","","","",null,31,{"$f":"IF(AND($L$1=\"\",$L$2=\"\"),\"\",IF($AA35>$Q$3-$Q$2+1,\"\",VLOOKUP($AA35,$R$5:$Y$600,AB$3,0)))","v":""},"","","","",""]
[16388,"VILLAGRAN Jan Jared","BEN-1","JOVCTDF","M",3.0300000000000002,null,"CCGRAC","CERCLE CATOLIC DE GRACIA",null,"CTT RIPOLLET","RIPLET",null,2,1,null,"","",null,"","","","","","",null,32,"","","","","",""]
[14525,"ALBUIXECH Marc","INF-3","JOVCTDF","M",939.28,null,"CELRA","CTT CELRA",null,"CC SANT ANDREU","S.ANDR",null,4,1,null,"","",null,"","","","","","",null,33,"","","","","",""]
[15332,"PAREDES Ivan","ALE-2","JOVCTDF","M",110.8,null,"CENTRE","EL CENTRE",null,"CATT SANT CELONI","S.CELO",null,3,1,null,"","",null,"","","","","","",null,34,"","","","","",""]
[15282,"FERNÁNDEZ Gael","BEN-1","JOVCTDF","M",6.379999999999999,null,"CIERVO","SCR EL CIERVO",null,"UE SANT CUGAT","S.CUGA",null,2,1,null,"","",null,"","","","","","",null,35,"","","","","",""]
[16703,"TALAVERON Aleix","PRE-0","JOVCTDF","M",6.01,null,"CLARAM","CTT LA TORRE DE CLARAMUNT",null,"CC SANTS","SANTS",null,1,1,null,"","",null,"","","","","","",null,36,"","","","","",""]
[15285,"TOBARÍAS Uriel","INF-3","JOVCTDF","M",910.07999999999993,null,"CNSABA","CN SABADELL",null,"CLUB TENNIS TAULA SENTMENAT","SENTME",null,4,1,null,"","",null,"","","","","","",null,37,"","","","","",""]
[11305,"ESCOBAR David","INF-3","JOVCTDF","M",10251.4,null,"COLLBA","CTT COLLBATO",null,"CTT DELS HORTS 2000","SVHORT",null,4,1,null,"","",null,"","","","","","",null,38,"","","","","",""]
[16719,"GARRIDO Axel","ALE-1","JOVCTDF","M",96.34,null,"CONGRE","AGRUPACIÓ CONGRÉS",null,"CTT TONA","TONA",null,3,1,null,"","",null,"","","","","","",null,39,"","","","","",""]
[15966,"BOCHACA Guiu","BEN-2","JOVCTDF","M",0,null,"CORNUD","CTT CORNUDELLA DE MONTSANT",null,"TT TORELLÓ","TORELL",null,2,1,null,"","",null,"","","","","","",null,40,"","","","","",""]
[14278,"IBAÑEZ Marcos","INF-1","JOVCTDF","M",392.21999999999997,null,"CPUVIL","CLUB PLA D'URGELL VILANOVENC",null,"TT LA UNIÓ","UNIO",null,4,1,null,"","",null,"","","","","","",null,41,{"$f":"IF(AND($L$1=\"\",$L$2=\"\"),\"\",IF($AA45>$Q$3-$Q$2+1,\"\",VLOOKUP($AA45,$R$5:$Y$600,AB$3,0)))","v":""},"","","","",""]
[15289,"GARCÍA Arnau","ALE-1","JOVCTDF","M",1281.02,null,"CSEANA","CTT CASTELLNOU DE SEANA",null,"CTT VALLS DE TORROELLA","VALLSTO",null,3,1,null,"","",null,"","","","","","",null,42,"","","","","",""]
[12036,"ROMO Pol","INF-3","JOVCTDF","M",8686.59,null,"CTGALI","CTT CASTELLGALÍ",null,"VIC TT","VICTT",null,4,1,null,"","",null,"","","","","","",null,43,"","","","","",""]
[15333,"MUÑOZ Mathias","ALE-1","JOVCTDF","M",27.05,null,"CTLLAR","ATT CASTELLAR",null,"CTT VILAFRANCA","VILAFR",null,3,1,null,"","",null,"","","","","","",null,44,"","","","","",""]
[11304,"FERNANDEZ David","INF-2","JOVCTDF","M",6714.45,null,"CTTBCN","CTT BARCELONA",null,"CTT VILANOVA I LA GELTRU","VILANO",null,4,1,null,"","",null,"","","","","","",null,45,"","","","","",""]
[10934,"PRIEGO Hristo","INF-3","JOVCTDF","M",5471.9400000000005,null,"ELS 8","ICELAND ELS 8",null,"CTT VILASSAR DE MAR","VILASS",null,4,1,null,"","",null,"","","","","","",null,46,"","","","","",""]
[14531,"CUCCHIETTI Gio","INF-1","JOVCTDF","M",1513.89,null,"ESCALA","CER L'ESCALA",null,null,null,null,4,1,null,"","",null,"","","","","","",null,47,"","","","","",""]
[16699,"NAVARRO Gerard","ALE-2","JOVCTDF","M",15.26,null,"ESPARR","CETT ESPARREGUERA",null,null,null,null,3,1,null,"","",null,"","","","","","",null,48,"","","","","",""]
[9145,"OBIOLS Pol","JUV-1","JOVCTDF","M",5322.0300000000007,null,"ESPLUGA","CTT L'ESPLUGA DE FRANCOLÍ",null,"Juvenil",5,null,5,1,null,"","",null,"","","","","","",null,49,"","","","","",""]
[15288,"DÍAZ Lluis","JUV-1","JOVCTDF","M",214.55,null,"FALCO","CLUB FALCONS SABADELL AE",null,"Infantil",4,null,5,1,null,"","",null,"","","","","","",null,50,"","","","","",""]
[15091,"EJARQUE Eduard","INF-2","CTGALI","M",1616.3999999999996,null,"FATJO","TT CAN FATJO",null,"Aleví",3,null,4,1,null,"","",null,"","","","","","",null,51,{"$f":"IF(AND($L$1=\"\",$L$2=\"\"),\"\",IF($AA55>$Q$3-$Q$2+1,\"\",VLOOKUP($AA55,$R$5:$Y$600,AB$3,0)))","v":""},"","","","",""]
[16722,"MARIN Ian","INF-1","CTGALI","M",8.64,null,"FOMEN","FOMENT MARTINENC",null,"Benjamí",2,null,4,1,null,"","",null,"","","","","","",null,52,"","","","","",""]
[15547,"SERRA Itzel","BEN-1","CTGALI","F",78.539999999999992,null,"GANXET","CTT GANXETS",null,"Prebenjamí",1,null,2,1,null,"","",null,"","","","","","",null,53,"","","","","",""]
[16730,"GONZALEZ Izan","BEN-2","CTGALI","M",3.92,null,"GIRONA","TT GIRONA CIUTAT",null,"Femení",0,null,2,1,null,"","",null,"","","","","","",null,54,"","","","","",""]
[16729,"GOLBANO Yerai","BEN-1","CTGALI","M",3.38,null,"GUISSO","ACLE GUISSONA",null,null,null,null,2,1,null,"","",null,"","","","","","",null,55,"","","","","",""]
[15059,"HERNÀNDEZ Martina","BEN-2","CTGALI","F",11.65,null,"HORTA","LLUÏSOS D' HORTA TT",null,"JUV-3",5,null,2,1,null,"","",null,"","","","","","",null,56,"","","","","",""]
[16318,"GARRACHON Oriol","BEN-2","CTGALI","M",71.13,null,"HOSPIT","TT L'HOSPITALET",null,"JUV-2",5,null,2,1,null,"","",null,"","","","","","",null,57,"","","","","",""]
[16024,"GRANADOS Claudi","INF-1","TONA","M",530.80999999999995,null,"IGUALA","CPP IGUALADA",null,"JUV-1",5,null,4,1,null,"","",null,"","","","","","",null,58,"","","","","",""]
[7589,"BUENO Poul Ignasi","INF-3","OLESA","M",5552.83,null,"IMPULS","IMPULS TENNIS TAULA",null,"INF-3",4,null,4,1,null,"","",null,"","","","","","",null,59,"","","","","",""]
[14360,"JIMENEZ Daniel","JUV-1","OLESA","M",686.68000000000006,null,"INDEPE","INDEPENDENT",null,"INF-2",4,null,5,1,null,"","",null,"","","","","","",null,60,"","","","","",""]
[15313,"EL MOUHMOUH Oumnia","BEN-2","INDEPE","F",2079.02,null,"IVORRA","CTT IVORRA",null,"INF-1",4,null,2,1,null,"","",null,"","","","","","",null,61,"","","","","",""]
[12685,"CASANOVAS Aina","BEN-2","INDEPE","F",512.6,null,"JARDÍ","CTT SANT QUINTI DE MEDIONA",null,"ALE-2",3,null,2,1,null,"","",null,"","","","","","",null,62,"","","","","",""]
[15279,"MARTÍNEZ Rafael","BEN-2","INDEPE","M",2781.29,null,"JEMAC","TT C JEMA",null,"ALE-1",3,null,2,1,null,"","",null,"","","","","","",null,63,"","","","","",""]
[15805,"EL MOUHMOUH Iman","PRE-0","INDEPE","F",10.92,null,"LIRAVE","CTT LA LIRA VENDRELLENCA",null,"BEN-2",2,null,1,1,null,"","",null,"","","","","","",null,64,"","","","","",""]
[15803,"MARTINEZ Paola","PRE-0","INDEPE","F",11,null,"LLEIDA","CTT LLEIDA",null,"BEN-1",2,null,1,1,null,{"$f":"IF(U69=\"\",\"\",COUNTIF($U$5:$U$600,\"<=\"&$U69))","v":""},{"$f":"IF(Q69=\"\",\"\",Q69-$Q$2+1)","v":""},null,{"$f":"IF(AND($O69=1,OR($L$1=$D69,$L$2=$D69)),A69,\"\")","v":""},{"$f":"IF(AND($O69=1,OR($L$1=$D69,$L$2=$D69)),B69,\"\")","v":""},{"$f":"IF(AND($O69=1,OR($L$1=$D69,$L$2=$D69)),C69,\"\")","v":""},{"$f":"IF(AND($O69=1,OR($L$1=$D69,$L$2=$D69)),D69,\"\")","v":""},{"$f":"IF(AND($O69=1,OR($L$1=$D69,$L$2=$D69)),E69,\"\")","v":""},{"$f":"IF(AND($O69=1,OR($L$1=$D69,$L$2=$D69)),F69,\"\")","v":""},null,65,"","","","","",""]
[12824,"FERRÉ Marcel","INF-3","HOSPIT","M",3126.08,null,"LLIÇA","ALIANÇA LLIÇÀ",null,"PRE-0",1,null,{"$f":"VLOOKUP(C70,$K$60:$L$70,2,0)","v":4},{"$f":"IF($L$3=\"\",1,IF($L$3=0,IF(E70=\"F\",1,0),IF(N70<=$L$3,1,0)))","v":1},null,"","",null,"","","","","","",null,{"$f":"AA69+1","v":66},{"$f":"IF(AND($L$1=\"\",$L$2=\"\"),\"\",IF($AA70>$Q$3-$Q$2+1,\"\",VLOOKUP($AA70,$R$5:$Y$600,AB$3,0)))","v":""},{"$f":"IF(AND($L$1=\"\",$L$2=\"\"),\"\",IF($AA70>$Q$3-$Q$2+1,\"\",VLOOKUP($AA70,$R$5:$Y$600,AC$3,0)))","v":""},"","","",""]
[12483,"DOMINGUEZ Pablo","JUV-1","HOSPIT","M",5162.91,null,"LLOREN","CENTRE D'ESPORTS LLORENÇÀ",null,null,null,null,5,1,null,"","",null,"","","","","","",null,67,"","","","","",""]
[14156,"GHASEMI Soheil","INF-3","HOSPIT","M",6924.85,null,"LLUÏSO","LLUÏSOS DE GRÀCIA",47,{"$f":"IF(INDIRECT(\"Hoja2!D\"&J72)=\"\",\"\",INDIRECT(\"Hoja2!D\"&J72))","v":""},{"$f":"IF(K72=\"\",\"\",IF(COUNTIF($K$72:$K$86,K72)=1,\"\",\" '\"&CHAR(64+COUNTIF($K$72:$K72,K72))&\"'\"))","v":""},null,4,1,null,"","",null,"","","","","","",null,68,"","","","","",""]
[11592,"SANCHÍS Marc","INF-2","HOSPIT","M",3050.3399999999997,null,"MASQUE","MASQUEFA TTC",{"$f":"J72+15","v":62},{"$f":"IF(INDIRECT(\"Hoja2!D\"&J73)=\"\",\"\",INDIRECT(\"Hoja2!D\"&J73))","v":""},{"$f":"IF(K73=\"\",\"\",IF(COUNTIF($K$72:$K$86,K73)=1,\"\",\" '\"&CHAR(64+COUNTIF($K$72:$K73,K73))&\"'\"))","v":""},null,4,1,null,"","",null,"","","","","","",null,69,"","","","","",""]
[14503,"BERTOLIN Dylan","ALE-2","HOSPIT","M",666.78,null,"MATARO","CN MATARÓ",{"$f":"J73+15","v":77},"",{"$f":"IF(K74=\"\",\"\",IF(COUNTIF($K$72:$K$86,K74)=1,\"\",\" '\"&CHAR(64+COUNTIF($K$72:$K74,K74))&\"'\"))","v":""},null,3,1,null,"","",null,"","","","","","",null,70,"","","","","",""]
[14026,"MORTE Arnau","JUV-1","HOSPIT","M",1493.68,null,"METS","CETT ELS METS",92,"",{"$f":"IF(K75=\"\",\"\",IF(COUNTIF($K$72:$K$86,K75)=1,\"\",\" '\"&CHAR(64+COUNTIF($K$72:$K75,K75))&\"'\"))","v":""},null,5,1,null,"","",null,"","","","","","",null,71,"","","","","",""]
[13442,"GONZÁLEZ Eric","JUV-1","HOSPIT","M",2697.9300000000003,null,"MOLINS","CTT ATC MOLINS DE REI",107,"",{"$f":"IF(K76=\"\",\"\",IF(COUNTIF($K$72:$K$86,K76)=1,\"\",\" '\"&CHAR(64+COUNTIF($K$72:$K76,K76))&\"'\"))","v":""},null,5,1,null,"","",null,"","","","","","",null,72,"","","","","",""]
[15455,"MOGEDANO Eric","JUV-1","HOSPIT","M",2278.75,null,"MOLLET","MOLLET 2002 TT",122,"",{"$f":"IF(K77=\"\",\"\",IF(COUNTIF($K$72:$K$86,K77)=1,\"\",\" '\"&CHAR(64+COUNTIF($K$72:$K77,K77))&\"'\"))","v":""},null,5,1,null,"","",null,"","","","","","",null,73,"","","","","",""]
[15482,"LIPARTELIANI Luka","INF-1","HOSPIT","M",1335.71,null,"MOLLSA","CTT MOLLERUSSA",137,"",{"$f":"IF(K78=\"\",\"\",IF(COUNTIF($K$72:$K$86,K78)=1,\"\",\" '\"&CHAR(64+COUNTIF($K$72:$K78,K78))&\"'\"))","v":""},null,4,1,null,"","",null,"","","","","","",null,74,"","","","","",""]
[15483,"CARTAÑA Pau","INF-1","HOSPIT","M",1434.62,null,"MONTBU","CTT MONTBUI",152,"",{"$f":"IF(K79=\"\",\"\",IF(COUNTIF($K$72:$K$86,K79)=1,\"\",\" '\"&CHAR(64+COUNTIF($K$72:$K79,K79))&\"'\"))","v":""},null,4,1,null,"","",null,"","","","","","",null,75,"","","","","",""]
[15471,"HERRERO Adria","INF-2","HOSPIT","M",237.60999999999999,null,"MORAEB","ACTT MORA D'EBRE",167,"",{"$f":"IF(K80=\"\",\"\",IF(COUNTIF($K$72:$K$86,K80)=1,\"\",\" '\"&CHAR(64+COUNTIF($K$72:$K80,K80))&\"'\"))","v":""},null,4,1,null,"","",null,"","","","","","",null,76,"",{"$f":"IF(AND($L$1=\"\",$L$2=\"\"),\"\",IF($AA80>$Q$3-$Q$2+1,\"\",VLOOKUP($AA80,$R$5:$Y$600,AC$3,0)))","v":""},"","","",""]
[15452,"JIMENEZ Alberto","INF-2","HOSPIT","M",487.51000000000005,null,"NASTIC","CLUB GIMNÀSTIC",182,"",{"$f":"IF(K81=\"\",\"\",IF(COUNTIF($K$72:$K$86,K81)=1,\"\",\" '\"&CHAR(64+COUNTIF($K$72:$K81,K81))&\"'\"))","v":""},null,4,1,null,"","",null,"","","","","","",null,77,"","","","","",""]
[14504,"GUERRERO Alexader Joel","ALE-1","HOSPIT","M",238.16,null,"OLESA","CTT OLESA",197,"",{"$f":"IF(K82=\"\",\"\",IF(COUNTIF($K$72:$K$86,K82)=1,\"\",\" '\"&CHAR(64+COUNTIF($K$72:$K82,K82))&\"'\"))","v":""},null,3,1,null,"","",null,"","","","","","",null,78,"","","","","",""]
[14501,"LORENZO Christian","BEN-2","HOSPIT","M",214.64999999999998,null,"OLOT","CTT OLOT",212,"",{"$f":"IF(K83=\"\",\"\",IF(COUNTIF($K$72:$K$86,K83)=1,\"\",\" '\"&CHAR(64+COUNTIF($K$72:$K83,K83))&\"'\"))","v":""},null,2,1,null,"","",null,"","","","","","",null,79,"","","","","",""]
[15454,"CUBERO Daniel","INF-1","HOSPIT","M",323.35000000000002,null,"PALAFR","CTT PALAFRUGELL",227,"",{"$f":"IF(K84=\"\",\"\",IF(COUNTIF($K$72:$K$86,K84)=1,\"\",\" '\"&CHAR(64+COUNTIF($K$72:$K84,K84))&\"'\"))","v":""},null,4,1,null,"","",null,"","","","","","",null,80,"","","","","",""]
[15458,"JORGOSO Erik","INF-1","HOSPIT","M",1016.01,null,"PALES","CTT JOSEP M. PALES",242,"",{"$f":"IF(K85=\"\",\"\",IF(COUNTIF($K$72:$K$86,K85)=1,\"\",\" '\"&CHAR(64+COUNTIF($K$72:$K85,K85))&\"'\"))","v":""},null,4,1,null,"","",null,"","","","","","",null,81,"","","","","",""]
[15456,"MORENO Hector","ALE-1","HOSPIT","M",684.57999999999993,null,"PARETS","TT PARETS",257,"",{"$f":"IF(K86=\"\",\"\",IF(COUNTIF($K$72:$K$86,K86)=1,\"\",\" '\"&CHAR(64+COUNTIF($K$72:$K86,K86))&\"'\"))","v":""},null,3,1,null,"","",null,"","","","","","",null,82,"","","","","",""]
[15457,"FERNANDEZ Iago","ALE-2","HOSPIT","M",71.890000000000015,null,"POBLA","CTT LA POBLA DE LILLET",null,null,null,null,3,1,null,"","",null,"","","","","","",null,83,"","","","","",""]
[15480,"CARDONA Ian","INF-1","HOSPIT","M",286.72000000000003,null,"PORTEL","CTT PORTELL",null,null,null,null,4,1,null,"","",null,"","","","","","",null,84,"","","","","",""]
[11671,"GUARCH Jofre","ALE-1","HOSPIT","M",19.43,null,"PRAT","TT PRAT",null,null,null,null,3,1,null,"","",null,"","","","","","",null,85,"","","","","",""]
[15453,"MARTIN Liam","INF-1","HOSPIT","M",488.73,null,"PREMIA","ATT PREMIÀ DE MAR",null,null,null,null,4,1,null,"","",null,"","","","","","",null,86,"",{"$f":"IF(AND($L$1=\"\",$L$2=\"\"),\"\",IF($AA90>$Q$3-$Q$2+1,\"\",VLOOKUP($AA90,$R$5:$Y$600,AC$3,0)))","v":""},"","","",""]
[16045,"ROMERA Marc","INF-3","HOSPIT","M",14.17,null,"QUIRZ","CTT SANT QUIRZE DEL VALLÈS",null,null,null,null,4,1,null,"","",null,"","","","","","",null,87,"","","","","",""]
[13506,"HERNANDO Marc","JUV-2","HOSPIT","M",1076.8700000000001,null,"QUIRZB","SANT QUIRZE TT",null,null,null,null,5,1,null,"","",null,"","","","","","",null,88,"","","","","",""]
[16210,"BELTRAN Pol","INF-2","HOSPIT","M",161.4,null,"R.ELISENDA","CEM REINA ELISENDA",null,null,null,null,4,1,null,"","",null,"","","","","","",null,89,"","","","","",""]
[16755,"CRUZ Mario","ALE-1","HOSPIT","M",91.65,null,"REUS","REUS DEPORTIU",null,null,null,null,3,1,null,"","",null,"","","","","","",null,90,"","","","","",""]
[16761,"ASTUDILLO Edilmar Aaron","ALE-2","HOSPIT","M",37.979999999999997,null,"RIPLET","CTT RIPOLLET",null,null,null,null,3,1,null,"","",null,"","","","","","",null,91,"","","","","",""]
[16762,"FERNANDEZ Adria","ALE-2","HOSPIT","M",80.300000000000011,null,"RIPOLL","CTT RIPOLL",null,null,null,null,3,1,null,"","",null,"","","","","","",null,92,"","","","","",""]
[16763,"SANDIN Antonio","ALE-2","HOSPIT","M",94.06,null,"RODA","CTT RODA DE TER",null,null,null,null,3,1,null,"","",null,"","","","","","",null,93,"","","","","",""]
[16764,"PEREZ Bruno","INF-1","HOSPIT","M",24.5,null,"S.ANDR","CC SANT ANDREU",null,null,null,null,4,1,null,"","",null,"","","","","","",null,94,"","","","","",""]
[16757,"PAGES Eric","BEN-1","HOSPIT","M",7.18,null,"S.CELO","CATT SANT CELONI",null,null,null,null,2,1,null,"","",null,"","","","","","",null,95,"","","","","",""]
[16765,"RUIZ Marc","INF-2","HOSPIT","M",70.260000000000005,null,"S.CUGA","UE SANT CUGAT",null,null,null,null,4,1,null,"","",null,"","","","","","",null,96,"",{"$f":"IF(AND($L$1=\"\",$L$2=\"\"),\"\",IF($AA100>$Q$3-$Q$2+1,\"\",VLOOKUP($AA100,$R$5:$Y$600,AC$3,0)))","v":""},"","","",""]
[16760,"MONTSERRAT Marti","PRE-0","HOSPIT","M",2.33,null,"SAFAJA","CTT SANT QUIRZE SAFAJA",null,null,null,null,1,1,null,"","",null,"","","","","","",null,97,"","","","","",""]
[16758,"BOLÍVAR Nicolas","PRE-0","HOSPIT","M",4.54,null,"SALLEN","CTT SALLENT",null,null,null,null,1,1,null,"","",null,"","","","","","",null,98,"","","","","",""]
[16759,"FERRER Oriol","BEN-1","HOSPIT","M",5.74,null,"SALOU","CTT SALOU",null,null,null,null,2,1,null,"","",null,"","","","","","",null,99,"","","","","",""]
[16766,"SEGURANA Pol","JUV-1","HOSPIT","M",278.21000000000004,null,"SANTS","CC SANTS",null,null,null,null,5,1,null,"","",null,"","","","","","",null,100,"","","","","",""]
[13641,"ARCOS Adrià","JUV-1","MATARO","M",3844.87,null,"SELVA","CTT LA SELVA",null,null,null,null,5,1,null,"","",null,"","","","","","",null,101,"","","","","",""]
[12922,"RODRIGUEZ Alba","INF-1","MATARO","F",8513.34,null,"SFCODI","CTT SANT FELIU DE CODINES",null,null,null,null,4,1,null,"","",null,"","","","","","",null,102,"","","","","",""]
[10482,"PALOMO Berta","INF-3","MATARO","F",4204.49,null,"SVHORT","CTT DELS HORTS 2000",null,null,null,null,4,1,null,"","",null,"","","","","","",null,103,"","","","","",""]
[15597,"PUERTO Eloi","ALE-1","MATARO","M",355.89,null,"TONA","CTT TONA",null,null,null,null,3,1,null,"","",null,"","","","","","",null,104,"","","","","",""]
[16160,"GÁZQUEZ Eric","INF-1","MATARO","M",352.20000000000005,null,"TORELL","TT TORELLÓ",null,null,null,null,4,1,null,"","",null,"","","","","","",null,105,"","","","","",""]
[15395,"PIJUAN Eudald","ALE-2","MATARO","M",1856.97,null,"TORROE","CTT TORROELLA DE MONTGRI",null,null,null,null,3,1,null,"","",null,"","","","","","",null,106,"",{"$f":"IF(AND($L$1=\"\",$L$2=\"\"),\"\",IF($AA110>$Q$3-$Q$2+1,\"\",VLOOKUP($AA110,$R$5:$Y$600,AC$3,0)))","v":""},"","","",""]
[10451,"DE SAN ANTONIO Eunice","INF-2","MATARO","F",3544.2700000000004,null,"TORTOS","CTT TORTOSA",null,null,null,null,4,1,null,"","",null,"","","","","","",null,107,"","","","","",""]
[15596,"NEYRA Gorka","INF-1","MATARO","M",1443.1599999999999,null,"TRAMUN","CTT TRAMUNTANA - FIGUERES",null,null,null,null,4,1,null,"","",null,"","","","","","",null,108,"","","","","",""]
[11537,"MATARÓ Isaac","ALE-2","MATARO","M",4550,null,"TREMP","CTT TREMP",null,null,null,null,3,1,null,"","",null,"","","","","","",null,109,"","","","","",""]
[13645,"GUIRAO Jordi","INF-1","MATARO","M",573.55000000000007,null,"TTCAS","TT CASSÀ",null,null,null,null,4,1,null,"","",null,"","","","","","",null,110,"","","","","",""]
[11351,"RIBAS Martí","INF-3","MATARO","M",1806.4299999999998,null,"TTSAND","TT SANT ANDREU",null,null,null,null,4,1,null,"","",null,"","","","","","",null,111,"","","","","",""]
[10862,"SANS Martina","INF-1","MATARO","F",8485.31,null,"ULLDEC","CJ ULLDECONA",null,null,null,null,4,1,null,"","",null,"","","","","","",null,112,"","","","","",""]
[16325,"SAOURI Mohamed","ALE-2","MATARO","M",21.509999999999998,null,"UNIO","TT LA UNIÓ",null,null,null,null,3,1,null,"","",null,"","","","","","",null,113,"","","","","",""]
[15779,"GONZALEZ Ot","INF-1","MATARO","M",847.04,null,"VANORD","CTT VALLS DEL NORD",null,null,null,null,4,1,null,"","",null,"","","","","","",null,114,"","","","","",""]
[15599,"SÁNCHEZ Pau","INF-2","MATARO","M",974.74999999999989,null,"VICTT","VIC TT",null,null,null,null,4,1,null,"","",null,"","","","","","",null,115,"","","","","",""]
[12566,"NUÑEZ Roc","ALE-2","MATARO","M",5467.15,null,"VILABL","CTT VILABLAREIX",null,null,null,null,3,1,null,"","",null,"","","","","","",null,116,"",{"$f":"IF(AND($L$1=\"\",$L$2=\"\"),\"\",IF($AA120>$Q$3-$Q$2+1,\"\",VLOOKUP($AA120,$R$5:$Y$600,AC$3,0)))","v":""},"","","",""]
[16792,"TERCERO Toni","ALE-1","MATARO","M",21.03,null,"VILAFR","CTT VILAFRANCA",null,null,null,null,3,1,null,"","",null,"","","","","","",null,117,"","","","","",""]
[16791,"SÁEZ Hiram","ALE-2","MATARO","M",330.31,null,"VILANO","CTT VILANOVA I LA GELTRU",null,null,null,null,3,1,null,"","",null,"","","","","","",null,118,"","","","","",""]
[16793,"EL AMIRI Mossaeb","ALE-2","MATARO","M",8.2100000000000009,null,"VILCA","CTT VILANOVA DEL CAMI",null,null,null,null,3,1,null,"","",null,"","","","","","",null,119,"","","","","",""]
[13165,"FLORES Axel","INF-3","VALLSTO","M",3107.67,null,"VINAROS","CTT VINARÒS",null,null,null,null,4,1,null,"","",null,"","","","","","",null,120,"","","","","",""]
[13164,"MENDEZ Gil","INF-3","VALLSTO","M",221.94,null,"XARXA","CTT XARXA MALGRAT",null,null,null,null,4,1,null,"","",null,"","","","","","",null,121,"","","","","",""]
[13964,"XANDRI Oriol","INF-2","VALLSTO","M",3771.6,null,"VALLSTO","CTT VALLS DE TORROELLA",null,null,null,null,4,1,null,"","",null,"","","","","","",null,122,"","","","","",""]
[16427,"MORA Raul","INF-1","IGUALA","M",177.18,null,"SENTME","CLUB TENNIS TAULA SENTMENAT",null,null,null,null,4,1,null,"","",null,"","","","","","",null,123,"","","","","",""]
[13770,"COSTA Joel","ALE-1","IGUALA","M",652.65,null,"JOVCTDF","ELS JOVES TT CASTELLDEFELS",null,null,null,null,3,1,null,"","",null,"","","","","","",null,124,"","","","","",""]
[16386,"PUIG Quim","BEN-2","IGUALA","M",44.13,null,"MOIAN","CTT MOIANES",null,null,null,null,2,1,null,"","",null,"","","","","","",null,125,"","","","","",""]
[16243,"VALLS Kevin","ALE-2","IGUALA","M",271.42999999999995,null,"VILASS","CTT VILASSAR DE MAR",null,null,null,null,3,1,null,"","",null,"","","","","","",null,126,"",{"$f":"IF(AND($L$1=\"\",$L$2=\"\"),\"\",IF($AA130>$Q$3-$Q$2+1,\"\",VLOOKUP($AA130,$R$5:$Y$600,AC$3,0)))","v":""},"","","",""]
[11298,"LUCO Guillem","ALE-2","IGUALA","M",95.360000000000014,null,"GRANO","CTT GRANOLLERS",null,null,null,null,3,1,null,"","",null,"","","","","","",null,127,"","","","","",""]
[15141,"CAMPS Pau","BEN-1","INDEPE","M",39.770000000000003,null,null,null,null,null,null,null,2,1,null,"","",null,"","","","","","",null,128,"","","","","",""]
[13370,"NADAL Met","ALE-2","INDEPE","M",189.68,null,null,null,null,null,null,null,3,1,null,{"$f":"IF(U133=\"\",\"\",COUNTIF($U$5:$U$600,\"<=\"&$U133))","v":""},{"$f":"IF(Q133=\"\",\"\",Q133-$Q$2+1)","v":""},null,{"$f":"IF(AND($O133=1,OR($L$1=$D133,$L$2=$D133)),A133,\"\")","v":""},{"$f":"IF(AND($O133=1,OR($L$1=$D133,$L$2=$D133)),B133,\"\")","v":""},{"$f":"IF(AND($O133=1,OR($L$1=$D133,$L$2=$D133)),C133,\"\")","v":""},{"$f":"IF(AND($O133=1,OR($L$1=$D133,$L$2=$D133)),D133,\"\")","v":""},{"$f":"IF(AND($O133=1,OR($L$1=$D133,$L$2=$D133)),E133,\"\")","v":""},{"$f":"IF(AND($O133=1,OR($L$1=$D133,$L$2=$D133)),F133,\"\")","v":""},null,129,"","","","","",""]
[14721,"COLL Biel","ALE-2","INDEPE","M",413.17000000000007,"MAX",null,null,null,null,null,null,{"$f":"VLOOKUP(C134,$K$60:$L$70,2,0)","v":3},{"$f":"IF($L$3=\"\",1,IF($L$3=0,IF(E134=\"F\",1,0),IF(N134<=$L$3,1,0)))","v":1},null,"","",null,"","","","","","",null,{"$f":"AA133+1","v":130},{"$f":"IF(AND($L$1=\"\",$L$2=\"\"),\"\",IF($AA134>$Q$3-$Q$2+1,\"\",VLOOKUP($AA134,$R$5:$Y$600,AB$3,0)))","v":""},"","","","",""]
[12869,"SEGURA Victor","ALE-2","INDEPE","M",85.83,{"$f":"MAX(G137:G211)","v":0},null,null,null,null,null,null,3,1,null,"","",null,"","","","","","",null,131,"","","","","",""]
[12904,"JIMENEZ Marti","INF-2","QUIRZ","M",236.7,null,null,50,null,null,null,null,4,1,null,"","",null,"","","","","","",null,132,"","","","","",""]
[16798,"VALERO Lucas","ALE-1","MOLLET","M",21.759999999999998,{"$f":"IF(J137=\"\",\"\",MAX(G$136:G136)+1)","v":""},{"$f":"IF(H136=5,1,H136+1)","v":1},{"$f":"IF(H136=5,I136+11,I136+1)","v":51},{"$f":"IF(K137=\"\",\"\",IF(COUNTIF(K$135:K136,K137)>0,\"\",COUNTIF(K$135:K$211,K137)))","v":""},{"$f":"IF(INDIRECT(\"Hoja2!F\"&I137)=\"\",\"\",IF(VLOOKUP(INDIRECT(\"Hoja2!F\"&I137),$H$5:$I$131,2,0)=Hoja2!$B$35,\"\",INDIRECT(\"Hoja2!F\"&I137)))","v":""},null,null,3,1,null,"","",null,"","","","","","",null,133,"","","","","",""]
[16799,"MORALES Marc","ALE-1","MOLLET","M",45.96,{"$f":"IF(J138=\"\",\"\",MAX(G$136:G137)+1)","v":""},{"$f":"IF(H137=5,1,H137+1)","v":2},{"$f":"IF(H137=5,I137+11,I137+1)","v":52},{"$f":"IF(K138=\"\",\"\",IF(COUNTIF(K$135:K137,K138)>0,\"\",COUNTIF(K$135:K$211,K138)))","v":""},{"$f":"IF(INDIRECT(\"Hoja2!F\"&I138)=\"\",\"\",IF(VLOOKUP(INDIRECT(\"Hoja2!F\"&I138),$H$5:$I$131,2,0)=Hoja2!$B$35,\"\",INDIRECT(\"Hoja2!F\"&I138)))","v":""},null,null,3,1,null,"","",null,"","","","","","",null,134,"","","","","",""]
[16800,"PICAZO Aaron","ALE-2","MOLLET","M",100.72,{"$f":"IF(J139=\"\",\"\",MAX(G$136:G138)+1)","v":""},3,53,{"$f":"IF(K139=\"\",\"\",IF(COUNTIF(K$135:K138,K139)>0,\"\",COUNTIF(K$135:K$211,K139)))","v":""},{"$f":"IF(INDIRECT(\"Hoja2!F\"&I139)=\"\",\"\",IF(VLOOKUP(INDIRECT(\"Hoja2!F\"&I139),$H$5:$I$131,2,0)=Hoja2!$B$35,\"\",INDIRECT(\"Hoja2!F\"&I139)))","v":""},null,null,3,1,null,"","",null,"","","","","","",null,135,"","","","","",""]
[16801,"CARRETERO Carla","ALE-1","MOLLET","F",5.33,{"$f":"IF(J140=\"\",\"\",MAX(G$136:G139)+1)","v":""},4,54,{"$f":"IF(K140=\"\",\"\",IF(COUNTIF(K$135:K139,K140)>0,\"\",COUNTIF(K$135:K$211,K140)))","v":""},{"$f":"IF(INDIRECT(\"Hoja2!F\"&I140)=\"\",\"\",IF(VLOOKUP(INDIRECT(\"Hoja2!F\"&I140),$H$5:$I$131,2,0)=Hoja2!$B$35,\"\",INDIRECT(\"Hoja2!F\"&I140)))","v":""},null,null,3,1,null,"","",null,"","","","","","",null,136,"",{"$f":"IF(AND($L$1=\"\",$L$2=\"\"),\"\",IF($AA140>$Q$3-$Q$2+1,\"\",VLOOKUP($AA140,$R$5:$Y$600,AC$3,0)))","v":""},"","","",""]
[16802,"CARRETERO Joel","PRE-0","MOLLET","M",4.7300000000000004,{"$f":"IF(J141=\"\",\"\",MAX(G$136:G140)+1)","v":""},5,55,{"$f":"IF(K141=\"\",\"\",IF(COUNTIF(K$135:K140,K141)>0,\"\",COUNTIF(K$135:K$211,K141)))","v":""},{"$f":"IF(INDIRECT(\"Hoja2!F\"&I141)=\"\",\"\",IF(VLOOKUP(INDIRECT(\"Hoja2!F\"&I141),$H$5:$I$131,2,0)=Hoja2!$B$35,\"\",INDIRECT(\"Hoja2!F\"&I141)))","v":""},null,null,1,1,null,"","",null,"","","","","","",null,137,"","","","","",""]
[15263,"BOUBAULT Lucas","ALE-1","CASTDF","M",23.44,{"$f":"IF(J142=\"\",\"\",MAX(G$136:G141)+1)","v":""},1,66,{"$f":"IF(K142=\"\",\"\",IF(COUNTIF(K$135:K141,K142)>0,\"\",COUNTIF(K$135:K$211,K142)))","v":""},{"$f":"IF(INDIRECT(\"Hoja2!F\"&I142)=\"\",\"\",IF(VLOOKUP(INDIRECT(\"Hoja2!F\"&I142),$H$5:$I$131,2,0)=Hoja2!$B$35,\"\",INDIRECT(\"Hoja2!F\"&I142)))","v":""},null,null,3,1,null,"","",null,"","","","","","",null,138,"","","","","",""]
[16082,"VALERO Emma","ALE-1","CASTDF","F",12.94,{"$f":"IF(J143=\"\",\"\",MAX(G$136:G142)+1)","v":""},2,67,{"$f":"IF(K143=\"\",\"\",IF(COUNTIF(K$135:K142,K143)>0,\"\",COUNTIF(K$135:K$211,K143)))","v":""},{"$f":"IF(INDIRECT(\"Hoja2!F\"&I143)=\"\",\"\",IF(VLOOKUP(INDIRECT(\"Hoja2!F\"&I143),$H$5:$I$131,2,0)=Hoja2!$B$35,\"\",INDIRECT(\"Hoja2!F\"&I143)))","v":""},null,null,3,1,null,"","",null,"","","","","","",null,139,"","","","","",""]
[16282,"PÉREZ Daniel","ALE-2","CASTDF","M",41.339999999999996,{"$f":"IF(J144=\"\",\"\",MAX(G$136:G143)+1)","v":""},3,68,{"$f":"IF(K144=\"\",\"\",IF(COUNTIF(K$135:K143,K144)>0,\"\",COUNTIF(K$135:K$211,K144)))","v":""},{"$f":"IF(INDIRECT(\"Hoja2!F\"&I144)=\"\",\"\",IF(VLOOKUP(INDIRECT(\"Hoja2!F\"&I144),$H$5:$I$131,2,0)=Hoja2!$B$35,\"\",INDIRECT(\"Hoja2!F\"&I144)))","v":""},null,null,3,1,null,"","",null,"","","","","","",null,140,"","","","","",""]
[16280,"RECASENS Jara","ALE-2","CASTDF","F",6.05,{"$f":"IF(J145=\"\",\"\",MAX(G$136:G144)+1)","v":""},4,69,{"$f":"IF(K145=\"\",\"\",IF(COUNTIF(K$135:K144,K145)>0,\"\",COUNTIF(K$135:K$211,K145)))","v":""},{"$f":"IF(INDIRECT(\"Hoja2!F\"&I145)=\"\",\"\",IF(VLOOKUP(INDIRECT(\"Hoja2!F\"&I145),$H$5:$I$131,2,0)=Hoja2!$B$35,\"\",INDIRECT(\"Hoja2!F\"&I145)))","v":""},null,null,3,1,null,"","",null,"","","","","","",null,141,"","","","","",""]
[15828,"MARTÍNEZ Gala","BEN-1","INDEPE","F",37.5,{"$f":"IF(J146=\"\",\"\",MAX(G$136:G145)+1)","v":""},5,70,{"$f":"IF(K146=\"\",\"\",IF(COUNTIF(K$135:K145,K146)>0,\"\",COUNTIF(K$135:K$211,K146)))","v":""},{"$f":"IF(INDIRECT(\"Hoja2!F\"&I146)=\"\",\"\",IF(VLOOKUP(INDIRECT(\"Hoja2!F\"&I146),$H$5:$I$131,2,0)=Hoja2!$B$35,\"\",INDIRECT(\"Hoja2!F\"&I146)))","v":""},null,null,2,1,null,"","",null,"","","","","","",null,142,"","","","","",""]
[16147,"HERNÁNDEZ David Andrés","BEN-1","CASTDF","M",9.93,{"$f":"IF(J147=\"\",\"\",MAX(G$136:G146)+1)","v":""},1,81,{"$f":"IF(K147=\"\",\"\",IF(COUNTIF(K$135:K146,K147)>0,\"\",COUNTIF(K$135:K$211,K147)))","v":""},{"$f":"IF(INDIRECT(\"Hoja2!F\"&I147)=\"\",\"\",IF(VLOOKUP(INDIRECT(\"Hoja2!F\"&I147),$H$5:$I$131,2,0)=Hoja2!$B$35,\"\",INDIRECT(\"Hoja2!F\"&I147)))","v":""},null,null,2,1,null,"","",null,"","","","","","",null,143,"","","","","",""]
[13638,"GUTIÉRREZ Marc","BEN-2","CASTDF","M",2277.0600000000004,{"$f":"IF(J148=\"\",\"\",MAX(G$136:G147)+1)","v":""},2,82,{"$f":"IF(K148=\"\",\"\",IF(COUNTIF(K$135:K147,K148)>0,\"\",COUNTIF(K$135:K$211,K148)))","v":""},{"$f":"IF(INDIRECT(\"Hoja2!F\"&I148)=\"\",\"\",IF(VLOOKUP(INDIRECT(\"Hoja2!F\"&I148),$H$5:$I$131,2,0)=Hoja2!$B$35,\"\",INDIRECT(\"Hoja2!F\"&I148)))","v":""},null,null,2,1,null,"","",null,"","","","","","",null,144,"","","","","",""]
[14927,"MARTÍNEZ Udai","BEN-2","CASTDF","M",730.57,{"$f":"IF(J149=\"\",\"\",MAX(G$136:G148)+1)","v":""},3,83,{"$f":"IF(K149=\"\",\"\",IF(COUNTIF(K$135:K148,K149)>0,\"\",COUNTIF(K$135:K$211,K149)))","v":""},{"$f":"IF(INDIRECT(\"Hoja2!F\"&I149)=\"\",\"\",IF(VLOOKUP(INDIRECT(\"Hoja2!F\"&I149),$H$5:$I$131,2,0)=Hoja2!$B$35,\"\",INDIRECT(\"Hoja2!F\"&I149)))","v":""},null,null,2,1,null,"","",null,"","","","","","",null,145,"","","","","",""]
[14928,"SÁNCHEZ Leo","BEN-2","CASTDF","M",335.36,{"$f":"IF(J150=\"\",\"\",MAX(G$136:G149)+1)","v":""},4,84,{"$f":"IF(K150=\"\",\"\",IF(COUNTIF(K$135:K149,K150)>0,\"\",COUNTIF(K$135:K$211,K150)))","v":""},{"$f":"IF(INDIRECT(\"Hoja2!F\"&I150)=\"\",\"\",IF(VLOOKUP(INDIRECT(\"Hoja2!F\"&I150),$H$5:$I$131,2,0)=Hoja2!$B$35,\"\",INDIRECT(\"Hoja2!F\"&I150)))","v":""},null,null,2,1,null,"","",null,"","","","","","",null,146,"",{"$f":"IF(AND($L$1=\"\",$L$2=\"\"),\"\",IF($AA150>$Q$3-$Q$2+1,\"\",VLOOKUP($AA150,$R$5:$Y$600,AC$3,0)))","v":""},"","","",""]
[16283,"PÉREZ Marcos","BEN-2","CASTDF","M",6.3599999999999994,{"$f":"IF(J151=\"\",\"\",MAX(G$136:G150)+1)","v":""},5,85,{"$f":"IF(K151=\"\",\"\",IF(COUNTIF(K$135:K150,K151)>0,\"\",COUNTIF(K$135:K$211,K151)))","v":""},{"$f":"IF(INDIRECT(\"Hoja2!F\"&I151)=\"\",\"\",IF(VLOOKUP(INDIRECT(\"Hoja2!F\"&I151),$H$5:$I$131,2,0)=Hoja2!$B$35,\"\",INDIRECT(\"Hoja2!F\"&I151)))","v":""},null,null,2,1,null,"","",null,"","","","","","",null,147,"","","","","",""]
[15817,"NAVARRO Izan","BEN-2","CASTDF","M",22.42,{"$f":"IF(J152=\"\",\"\",MAX(G$136:G151)+1)","v":""},1,96,{"$f":"IF(K152=\"\",\"\",IF(COUNTIF(K$135:K151,K152)>0,\"\",COUNTIF(K$135:K$211,K152)))","v":""},{"$f":"IF(INDIRECT(\"Hoja2!F\"&I152)=\"\",\"\",IF(VLOOKUP(INDIRECT(\"Hoja2!F\"&I152),$H$5:$I$131,2,0)=Hoja2!$B$35,\"\",INDIRECT(\"Hoja2!F\"&I152)))","v":""},null,null,2,1,null,"","",null,"","","","","","",null,148,"","","","","",""]
[14882,"MARTÍN Hector","INF-1","CASTDF","M",120.98000000000002,{"$f":"IF(J153=\"\",\"\",MAX(G$136:G152)+1)","v":""},2,97,{"$f":"IF(K153=\"\",\"\",IF(COUNTIF(K$135:K152,K153)>0,\"\",COUNTIF(K$135:K$211,K153)))","v":""},{"$f":"IF(INDIRECT(\"Hoja2!F\"&I153)=\"\",\"\",IF(VLOOKUP(INDIRECT(\"Hoja2!F\"&I153),$H$5:$I$131,2,0)=Hoja2!$B$35,\"\",INDIRECT(\"Hoja2!F\"&I153)))","v":""},null,null,4,1,null,"","",null,"","","","","","",null,149,"","","","","",""]
[16155,"BRUN Gustav","INF-1","CASTDF","M",75.899999999999991,{"$f":"IF(J154=\"\",\"\",MAX(G$136:G153)+1)","v":""},3,98,{"$f":"IF(K154=\"\",\"\",IF(COUNTIF(K$135:K153,K154)>0,\"\",COUNTIF(K$135:K$211,K154)))","v":""},{"$f":"IF(INDIRECT(\"Hoja2!F\"&I154)=\"\",\"\",IF(VLOOKUP(INDIRECT(\"Hoja2!F\"&I154),$H$5:$I$131,2,0)=Hoja2!$B$35,\"\",INDIRECT(\"Hoja2!F\"&I154)))","v":""},null,null,4,1,null,"","",null,"","","","","","",null,150,"","","","","",""]
[15985,"GOMÉZ Joan","ALE-1","CASTDF","M",30.42,{"$f":"IF(J155=\"\",\"\",MAX(G$136:G154)+1)","v":""},{"$f":"IF(H154=5,1,H154+1)","v":4},{"$f":"IF(H154=5,I154+11,I154+1)","v":99},{"$f":"IF(K155=\"\",\"\",IF(COUNTIF(K$135:K154,K155)>0,\"\",COUNTIF(K$135:K$211,K155)))","v":""},{"$f":"IF(INDIRECT(\"Hoja2!F\"&I155)=\"\",\"\",IF(VLOOKUP(INDIRECT(\"Hoja2!F\"&I155),$H$5:$I$131,2,0)=Hoja2!$B$35,\"\",INDIRECT(\"Hoja2!F\"&I155)))","v":""},null,null,3,1,null,"","",null,"","","","","","",null,151,"","","","","",""]
[14883,"GONZÁLEZ Jan","INF-2","CASTDF","M",3108.12,{"$f":"IF(J156=\"\",\"\",MAX(G$136:G155)+1)","v":""},5,100,{"$f":"IF(K156=\"\",\"\",IF(COUNTIF(K$135:K155,K156)>0,\"\",COUNTIF(K$135:K$211,K156)))","v":""},{"$f":"IF(INDIRECT(\"Hoja2!F\"&I156)=\"\",\"\",IF(VLOOKUP(INDIRECT(\"Hoja2!F\"&I156),$H$5:$I$131,2,0)=Hoja2!$B$35,\"\",INDIRECT(\"Hoja2!F\"&I156)))","v":""},null,null,4,1,null,"","",null,"","","","","","",null,152,"","","","","",""]
[14884,"GONZÁLEZ F. Martina","INF-2","CASTDF","F",396.5,{"$f":"IF(J157=\"\",\"\",MAX(G$136:G156)+1)","v":""},1,111,{"$f":"IF(K157=\"\",\"\",IF(COUNTIF(K$135:K156,K157)>0,\"\",COUNTIF(K$135:K$211,K157)))","v":""},{"$f":"IF(INDIRECT(\"Hoja2!F\"&I157)=\"\",\"\",IF(VLOOKUP(INDIRECT(\"Hoja2!F\"&I157),$H$5:$I$131,2,0)=Hoja2!$B$35,\"\",INDIRECT(\"Hoja2!F\"&I157)))","v":""},null,null,4,1,null,"","",null,"","","","","","",null,153,"","","","","",""]
[16157,"GONZALEZ Sonia","INF-2","CASTDF","F",68.849999999999994,{"$f":"IF(J158=\"\",\"\",MAX(G$136:G157)+1)","v":""},2,112,{"$f":"IF(K158=\"\",\"\",IF(COUNTIF(K$135:K157,K158)>0,\"\",COUNTIF(K$135:K$211,K158)))","v":""},{"$f":"IF(INDIRECT(\"Hoja2!F\"&I158)=\"\",\"\",IF(VLOOKUP(INDIRECT(\"Hoja2!F\"&I158),$H$5:$I$131,2,0)=Hoja2!$B$35,\"\",INDIRECT(\"Hoja2!F\"&I158)))","v":""},null,null,4,1,null,"","",null,"","","","","","",null,154,"","","","","",""]
[15564,"VERA Berkano Aker","INF-3","CASTDF","M",696.87000000000012,{"$f":"IF(J159=\"\",\"\",MAX(G$136:G158)+1)","v":""},3,113,{"$f":"IF(K159=\"\",\"\",IF(COUNTIF(K$135:K158,K159)>0,\"\",COUNTIF(K$135:K$211,K159)))","v":""},{"$f":"IF(INDIRECT(\"Hoja2!F\"&I159)=\"\",\"\",IF(VLOOKUP(INDIRECT(\"Hoja2!F\"&I159),$H$5:$I$131,2,0)=Hoja2!$B$35,\"\",INDIRECT(\"Hoja2!F\"&I159)))","v":""},null,null,4,1,null,"","",null,"","","","","","",null,155,"","","","","",""]
[16807,"MOLINA Maria Janny","ALE-1","HOSPIT","F",3964.49,{"$f":"IF(J160=\"\",\"\",MAX(G$136:G159)+1)","v":""},4,114,{"$f":"IF(K160=\"\",\"\",IF(COUNTIF(K$135:K159,K160)>0,\"\",COUNTIF(K$135:K$211,K160)))","v":""},{"$f":"IF(INDIRECT(\"Hoja2!F\"&I160)=\"\",\"\",IF(VLOOKUP(INDIRECT(\"Hoja2!F\"&I160),$H$5:$I$131,2,0)=Hoja2!$B$35,\"\",INDIRECT(\"Hoja2!F\"&I160)))","v":""},null,null,3,1,null,"","",null,"","","","","","",null,156,"",{"$f":"IF(AND($L$1=\"\",$L$2=\"\"),\"\",IF($AA160>$Q$3-$Q$2+1,\"\",VLOOKUP($AA160,$R$5:$Y$600,AC$3,0)))","v":""},"","","",""]
[16716,"BOSCH Guim","ALE-1","CARDED","M",79.25,{"$f":"IF(J161=\"\",\"\",MAX(G$136:G160)+1)","v":""},5,115,{"$f":"IF(K161=\"\",\"\",IF(COUNTIF(K$135:K160,K161)>0,\"\",COUNTIF(K$135:K$211,K161)))","v":""},{"$f":"IF(INDIRECT(\"Hoja2!F\"&I161)=\"\",\"\",IF(VLOOKUP(INDIRECT(\"Hoja2!F\"&I161),$H$5:$I$131,2,0)=Hoja2!$B$35,\"\",INDIRECT(\"Hoja2!F\"&I161)))","v":""},null,null,3,1,null,"","",null,"","","","","","",null,157,"","","","","",""]
[16740,"CASTAÑÉ Iol","INF-2","CARDED","M",101.04,{"$f":"IF(J162=\"\",\"\",MAX(G$136:G161)+1)","v":""},1,126,{"$f":"IF(K162=\"\",\"\",IF(COUNTIF(K$135:K161,K162)>0,\"\",COUNTIF(K$135:K$211,K162)))","v":""},{"$f":"IF(INDIRECT(\"Hoja2!F\"&I162)=\"\",\"\",IF(VLOOKUP(INDIRECT(\"Hoja2!F\"&I162),$H$5:$I$131,2,0)=Hoja2!$B$35,\"\",INDIRECT(\"Hoja2!F\"&I162)))","v":""},null,null,4,1,null,"","",null,"","","","","","",null,158,"","","","","",""]
[16745,"GRACIA Nuno","INF-1","CARDED","M",122.44,{"$f":"IF(J163=\"\",\"\",MAX(G$136:G162)+1)","v":""},2,127,{"$f":"IF(K163=\"\",\"\",IF(COUNTIF(K$135:K162,K163)>0,\"\",COUNTIF(K$135:K$211,K163)))","v":""},{"$f":"IF(INDIRECT(\"Hoja2!F\"&I163)=\"\",\"\",IF(VLOOKUP(INDIRECT(\"Hoja2!F\"&I163),$H$5:$I$131,2,0)=Hoja2!$B$35,\"\",INDIRECT(\"Hoja2!F\"&I163)))","v":""},null,null,4,1,null,"","",null,"","","","","","",null,159,"","","","","",""]
[16738,"AGULLÓ Kai","INF-1","CARDED","M",114.72,{"$f":"IF(J164=\"\",\"\",MAX(G$136:G163)+1)","v":""},3,128,{"$f":"IF(K164=\"\",\"\",IF(COUNTIF(K$135:K163,K164)>0,\"\",COUNTIF(K$135:K$211,K164)))","v":""},{"$f":"IF(INDIRECT(\"Hoja2!F\"&I164)=\"\",\"\",IF(VLOOKUP(INDIRECT(\"Hoja2!F\"&I164),$H$5:$I$131,2,0)=Hoja2!$B$35,\"\",INDIRECT(\"Hoja2!F\"&I164)))","v":""},null,null,4,1,null,"","",null,"","","","","","",null,160,"","","","","",""]
[15517,"LIAO Arnau","BEN-2","CARDED","M",16.55,{"$f":"IF(J165=\"\",\"\",MAX(G$136:G164)+1)","v":""},4,129,{"$f":"IF(K165=\"\",\"\",IF(COUNTIF(K$135:K164,K165)>0,\"\",COUNTIF(K$135:K$211,K165)))","v":""},{"$f":"IF(INDIRECT(\"Hoja2!F\"&I165)=\"\",\"\",IF(VLOOKUP(INDIRECT(\"Hoja2!F\"&I165),$H$5:$I$131,2,0)=Hoja2!$B$35,\"\",INDIRECT(\"Hoja2!F\"&I165)))","v":""},null,null,2,1,null,"","",null,"","","","","","",null,161,"","","","","",""]
[16747,"RUSIÑOL Guillem","INF-1","CARDED","M",195.88,{"$f":"IF(J166=\"\",\"\",MAX(G$136:G165)+1)","v":""},5,130,{"$f":"IF(K166=\"\",\"\",IF(COUNTIF(K$135:K165,K166)>0,\"\",COUNTIF(K$135:K$211,K166)))","v":""},{"$f":"IF(INDIRECT(\"Hoja2!F\"&I166)=\"\",\"\",IF(VLOOKUP(INDIRECT(\"Hoja2!F\"&I166),$H$5:$I$131,2,0)=Hoja2!$B$35,\"\",INDIRECT(\"Hoja2!F\"&I166)))","v":""},null,null,4,1,null,"","",null,"","","","","","",null,162,"","","","","",""]
[12344,"VALERO Roc","INF-1","CARDED","M",232.85,{"$f":"IF(J167=\"\",\"\",MAX(G$136:G166)+1)","v":""},1,141,{"$f":"IF(K167=\"\",\"\",IF(COUNTIF(K$135:K166,K167)>0,\"\",COUNTIF(K$135:K$211,K167)))","v":""},{"$f":"IF(INDIRECT(\"Hoja2!F\"&I167)=\"\",\"\",IF(VLOOKUP(INDIRECT(\"Hoja2!F\"&I167),$H$5:$I$131,2,0)=Hoja2!$B$35,\"\",INDIRECT(\"Hoja2!F\"&I167)))","v":""},null,null,4,1,null,"","",null,"","","","","","",null,163,"","","","","",""]
[15516,"VERDUGO Bruno","INF-2","CARDED","M",335.63,{"$f":"IF(J168=\"\",\"\",MAX(G$136:G167)+1)","v":""},{"$f":"IF(H167=5,1,H167+1)","v":2},{"$f":"IF(H167=5,I167+11,I167+1)","v":142},{"$f":"IF(K168=\"\",\"\",IF(COUNTIF(K$135:K167,K168)>0,\"\",COUNTIF(K$135:K$211,K168)))","v":""},{"$f":"IF(INDIRECT(\"Hoja2!F\"&I168)=\"\",\"\",IF(VLOOKUP(INDIRECT(\"Hoja2!F\"&I168),$H$5:$I$131,2,0)=Hoja2!$B$35,\"\",INDIRECT(\"Hoja2!F\"&I168)))","v":""},null,null,4,1,null,"","",null,"","","","","","",null,164,"","","","","",""]
[10860,"GIBERT Roc","ALE-2","INDEPE","M",11472.720000000001,{"$f":"IF(J169=\"\",\"\",MAX(G$136:G168)+1)","v":""},3,143,{"$f":"IF(K169=\"\",\"\",IF(COUNTIF(K$135:K168,K169)>0,\"\",COUNTIF(K$135:K$211,K169)))","v":""},{"$f":"IF(INDIRECT(\"Hoja2!F\"&I169)=\"\",\"\",IF(VLOOKUP(INDIRECT(\"Hoja2!F\"&I169),$H$5:$I$131,2,0)=Hoja2!$B$35,\"\",INDIRECT(\"Hoja2!F\"&I169)))","v":""},null,null,3,1,null,"","",null,"","","","","","",null,165,"","","","","",""]
[16389,"CARRERA Adrià","ALE-1","AMICS","M",17.36,{"$f":"IF(J170=\"\",\"\",MAX(G$136:G169)+1)","v":""},4,144,{"$f":"IF(K170=\"\",\"\",IF(COUNTIF(K$135:K169,K170)>0,\"\",COUNTIF(K$135:K$211,K170)))","v":""},{"$f":"IF(INDIRECT(\"Hoja2!F\"&I170)=\"\",\"\",IF(VLOOKUP(INDIRECT(\"Hoja2!F\"&I170),$H$5:$I$131,2,0)=Hoja2!$B$35,\"\",INDIRECT(\"Hoja2!F\"&I170)))","v":""},null,null,3,1,null,"","",null,"","","","","","",null,166,"",{"$f":"IF(AND($L$1=\"\",$L$2=\"\"),\"\",IF($AA170>$Q$3-$Q$2+1,\"\",VLOOKUP($AA170,$R$5:$Y$600,AC$3,0)))","v":""},"","","",""]
[16403,"MAMPEL Marc","PRE-0","AMICS","M",6.08,{"$f":"IF(J171=\"\",\"\",MAX(G$136:G170)+1)","v":""},5,145,{"$f":"IF(K171=\"\",\"\",IF(COUNTIF(K$135:K170,K171)>0,\"\",COUNTIF(K$135:K$211,K171)))","v":""},{"$f":"IF(INDIRECT(\"Hoja2!F\"&I171)=\"\",\"\",IF(VLOOKUP(INDIRECT(\"Hoja2!F\"&I171),$H$5:$I$131,2,0)=Hoja2!$B$35,\"\",INDIRECT(\"Hoja2!F\"&I171)))","v":""},null,null,1,1,null,"","",null,"","","","","","",null,167,"","","","","",""]
[15642,"CARMONA Rodrigo","JUV-1","AMICS","M",268.48,{"$f":"IF(J172=\"\",\"\",MAX(G$136:G171)+1)","v":""},1,156,{"$f":"IF(K172=\"\",\"\",IF(COUNTIF(K$135:K171,K172)>0,\"\",COUNTIF(K$135:K$211,K172)))","v":""},{"$f":"IF(INDIRECT(\"Hoja2!F\"&I172)=\"\",\"\",IF(VLOOKUP(INDIRECT(\"Hoja2!F\"&I172),$H$5:$I$131,2,0)=Hoja2!$B$35,\"\",INDIRECT(\"Hoja2!F\"&I172)))","v":""},null,null,5,1,null,"","",null,"","","","","","",null,168,"","","","","",""]
[16770,"ROMERO Ruben","INF-3","AMICS","M",63.42,{"$f":"IF(J173=\"\",\"\",MAX(G$136:G172)+1)","v":""},2,157,{"$f":"IF(K173=\"\",\"\",IF(COUNTIF(K$135:K172,K173)>0,\"\",COUNTIF(K$135:K$211,K173)))","v":""},{"$f":"IF(INDIRECT(\"Hoja2!F\"&I173)=\"\",\"\",IF(VLOOKUP(INDIRECT(\"Hoja2!F\"&I173),$H$5:$I$131,2,0)=Hoja2!$B$35,\"\",INDIRECT(\"Hoja2!F\"&I173)))","v":""},null,null,4,1,null,"","",null,"","","","","","",null,169,"","","","","",""]
[16769,"VAZQUEZ Alvaro","INF-3","AMICS","M",198.73000000000002,{"$f":"IF(J174=\"\",\"\",MAX(G$136:G173)+1)","v":""},3,158,{"$f":"IF(K174=\"\",\"\",IF(COUNTIF(K$135:K173,K174)>0,\"\",COUNTIF(K$135:K$211,K174)))","v":""},{"$f":"IF(INDIRECT(\"Hoja2!F\"&I174)=\"\",\"\",IF(VLOOKUP(INDIRECT(\"Hoja2!F\"&I174),$H$5:$I$131,2,0)=Hoja2!$B$35,\"\",INDIRECT(\"Hoja2!F\"&I174)))","v":""},null,null,4,1,null,"","",null,"","","","","","",null,170,"","","","","",""]
[15030,"CRUZ Geroni","INF-2","AMICS","M",572.43000000000006,{"$f":"IF(J175=\"\",\"\",MAX(G$136:G174)+1)","v":""},4,159,{"$f":"IF(K175=\"\",\"\",IF(COUNTIF(K$135:K174,K175)>0,\"\",COUNTIF(K$135:K$211,K175)))","v":""},{"$f":"IF(INDIRECT(\"Hoja2!F\"&I175)=\"\",\"\",IF(VLOOKUP(INDIRECT(\"Hoja2!F\"&I175),$H$5:$I$131,2,0)=Hoja2!$B$35,\"\",INDIRECT(\"Hoja2!F\"&I175)))","v":""},null,null,4,1,null,"","",null,"","","","","","",null,171,"","","","","",""]
[16771,"MONTAÑÁ Miquel","INF-1","AMICS","M",100.68,{"$f":"IF(J176=\"\",\"\",MAX(G$136:G175)+1)","v":""},5,160,{"$f":"IF(K176=\"\",\"\",IF(COUNTIF(K$135:K175,K176)>0,\"\",COUNTIF(K$135:K$211,K176)))","v":""},{"$f":"IF(INDIRECT(\"Hoja2!F\"&I176)=\"\",\"\",IF(VLOOKUP(INDIRECT(\"Hoja2!F\"&I176),$H$5:$I$131,2,0)=Hoja2!$B$35,\"\",INDIRECT(\"Hoja2!F\"&I176)))","v":""},null,null,4,1,null,"","",null,"","","","","","",null,172,"","","","","",""]
[16768,"ARNAU Berta","INF-1","AMICS","F",50.79,{"$f":"IF(J177=\"\",\"\",MAX(G$136:G176)+1)","v":""},1,171,{"$f":"IF(K177=\"\",\"\",IF(COUNTIF(K$135:K176,K177)>0,\"\",COUNTIF(K$135:K$211,K177)))","v":""},{"$f":"IF(INDIRECT(\"Hoja2!F\"&I177)=\"\",\"\",IF(VLOOKUP(INDIRECT(\"Hoja2!F\"&I177),$H$5:$I$131,2,0)=Hoja2!$B$35,\"\",INDIRECT(\"Hoja2!F\"&I177)))","v":""},null,null,4,1,null,"","",null,"","","","","","",null,173,"","","","","",""]
[16767,"GUISADO Aitor","ALE-2","AMICS","M",23.269999999999996,{"$f":"IF(J178=\"\",\"\",MAX(G$136:G177)+1)","v":""},2,172,{"$f":"IF(K178=\"\",\"\",IF(COUNTIF(K$135:K177,K178)>0,\"\",COUNTIF(K$135:K$211,K178)))","v":""},{"$f":"IF(INDIRECT(\"Hoja2!F\"&I178)=\"\",\"\",IF(VLOOKUP(INDIRECT(\"Hoja2!F\"&I178),$H$5:$I$131,2,0)=Hoja2!$B$35,\"\",INDIRECT(\"Hoja2!F\"&I178)))","v":""},null,null,3,1,null,"","",null,"","","","","","",null,174,"","","","","",""]
[16776,"DIAZ Jon","ALE-1","AMICS","M",15.040000000000001,{"$f":"IF(J179=\"\",\"\",MAX(G$136:G178)+1)","v":""},3,173,{"$f":"IF(K179=\"\",\"\",IF(COUNTIF(K$135:K178,K179)>0,\"\",COUNTIF(K$135:K$211,K179)))","v":""},{"$f":"IF(INDIRECT(\"Hoja2!F\"&I179)=\"\",\"\",IF(VLOOKUP(INDIRECT(\"Hoja2!F\"&I179),$H$5:$I$131,2,0)=Hoja2!$B$35,\"\",INDIRECT(\"Hoja2!F\"&I179)))","v":""},null,null,3,1,null,"","",null,"","","","","","",null,175,"","","","","",""]
[15624,"MONTAÑÁ Josep","BEN-2","AMICS","M",53.25,{"$f":"IF(J180=\"\",\"\",MAX(G$136:G179)+1)","v":""},4,174,{"$f":"IF(K180=\"\",\"\",IF(COUNTIF(K$135:K179,K180)>0,\"\",COUNTIF(K$135:K$211,K180)))","v":""},{"$f":"IF(INDIRECT(\"Hoja2!F\"&I180)=\"\",\"\",IF(VLOOKUP(INDIRECT(\"Hoja2!F\"&I180),$H$5:$I$131,2,0)=Hoja2!$B$35,\"\",INDIRECT(\"Hoja2!F\"&I180)))","v":""},null,null,2,1,null,"","",null,"","","","","","",null,176,"",{"$f":"IF(AND($L$1=\"\",$L$2=\"\"),\"\",IF($AA180>$Q$3-$Q$2+1,\"\",VLOOKUP($AA180,$R$5:$Y$600,AC$3,0)))","v":""},"","","",""]
[15602,"ROCABERT Aina","BEN-2","AMICS","F",9.27,{"$f":"IF(J181=\"\",\"\",MAX(G$136:G180)+1)","v":""},5,175,{"$f":"IF(K181=\"\",\"\",IF(COUNTIF(K$135:K180,K181)>0,\"\",COUNTIF(K$135:K$211,K181)))","v":""},{"$f":"IF(INDIRECT(\"Hoja2!F\"&I181)=\"\",\"\",IF(VLOOKUP(INDIRECT(\"Hoja2!F\"&I181),$H$5:$I$131,2,0)=Hoja2!$B$35,\"\",INDIRECT(\"Hoja2!F\"&I181)))","v":""},null,null,2,1,null,"","",null,"","","","","","",null,177,"","","","","",""]
[15601,"ROCABERT Judit","BEN-2","AMICS","F",12.280000000000001,{"$f":"IF(J182=\"\",\"\",MAX(G$136:G181)+1)","v":""},1,186,{"$f":"IF(K182=\"\",\"\",IF(COUNTIF(K$135:K181,K182)>0,\"\",COUNTIF(K$135:K$211,K182)))","v":""},{"$f":"IF(INDIRECT(\"Hoja2!F\"&I182)=\"\",\"\",IF(VLOOKUP(INDIRECT(\"Hoja2!F\"&I182),$H$5:$I$131,2,0)=Hoja2!$B$35,\"\",INDIRECT(\"Hoja2!F\"&I182)))","v":""},null,null,2,1,null,"","",null,"","","","","","",null,178,"","","","","",""]
[15519,"ORTEGA Marc","BEN-1","AMICS","M",5.34,{"$f":"IF(J183=\"\",\"\",MAX(G$136:G182)+1)","v":""},2,187,{"$f":"IF(K183=\"\",\"\",IF(COUNTIF(K$135:K182,K183)>0,\"\",COUNTIF(K$135:K$211,K183)))","v":""},{"$f":"IF(INDIRECT(\"Hoja2!F\"&I183)=\"\",\"\",IF(VLOOKUP(INDIRECT(\"Hoja2!F\"&I183),$H$5:$I$131,2,0)=Hoja2!$B$35,\"\",INDIRECT(\"Hoja2!F\"&I183)))","v":""},null,null,2,1,null,"","",null,"","","","","","",null,179,"","","","","",""]
[11949,"DACHS Gil","INF-2","VICTT","M",2381.4299999999998,{"$f":"IF(J184=\"\",\"\",MAX(G$136:G183)+1)","v":""},3,188,{"$f":"IF(K184=\"\",\"\",IF(COUNTIF(K$135:K183,K184)>0,\"\",COUNTIF(K$135:K$211,K184)))","v":""},{"$f":"IF(INDIRECT(\"Hoja2!F\"&I184)=\"\",\"\",IF(VLOOKUP(INDIRECT(\"Hoja2!F\"&I184),$H$5:$I$131,2,0)=Hoja2!$B$35,\"\",INDIRECT(\"Hoja2!F\"&I184)))","v":""},null,null,4,1,null,"","",null,"","","","","","",null,180,"","","","","",""]
[14061,"GONZÁLEZ A. Martina","INF-2","VICTT","F",2911.8199999999997,{"$f":"IF(J185=\"\",\"\",MAX(G$136:G184)+1)","v":""},4,189,{"$f":"IF(K185=\"\",\"\",IF(COUNTIF(K$135:K184,K185)>0,\"\",COUNTIF(K$135:K$211,K185)))","v":""},{"$f":"IF(INDIRECT(\"Hoja2!F\"&I185)=\"\",\"\",IF(VLOOKUP(INDIRECT(\"Hoja2!F\"&I185),$H$5:$I$131,2,0)=Hoja2!$B$35,\"\",INDIRECT(\"Hoja2!F\"&I185)))","v":""},null,null,4,1,null,"","",null,"","","","","","",null,181,"","","","","",""]
[15853,"JIMÉNEZ Jordi","INF-2","VICTT","M",232.86,{"$f":"IF(J186=\"\",\"\",MAX(G$136:G185)+1)","v":""},5,190,{"$f":"IF(K186=\"\",\"\",IF(COUNTIF(K$135:K185,K186)>0,\"\",COUNTIF(K$135:K$211,K186)))","v":""},{"$f":"IF(INDIRECT(\"Hoja2!F\"&I186)=\"\",\"\",IF(VLOOKUP(INDIRECT(\"Hoja2!F\"&I186),$H$5:$I$131,2,0)=Hoja2!$B$35,\"\",INDIRECT(\"Hoja2!F\"&I186)))","v":""},null,null,4,1,null,"","",null,"","","","","","",null,182,"","","","","",""]
[12576,"LLOVERA Eloi","ALE-2","VICTT","M",366.80999999999995,{"$f":"IF(J187=\"\",\"\",MAX(G$136:G186)+1)","v":""},1,201,{"$f":"IF(K187=\"\",\"\",IF(COUNTIF(K$135:K186,K187)>0,\"\",COUNTIF(K$135:K$211,K187)))","v":""},{"$f":"IF(INDIRECT(\"Hoja2!F\"&I187)=\"\",\"\",IF(VLOOKUP(INDIRECT(\"Hoja2!F\"&I187),$H$5:$I$131,2,0)=Hoja2!$B$35,\"\",INDIRECT(\"Hoja2!F\"&I187)))","v":""},null,null,3,1,null,"","",null,"","","","","","",null,183,"","","","","",""]
[8615,"PORTET Joaquim","INF-2","VICTT","M",6464.82,{"$f":"IF(J188=\"\",\"\",MAX(G$136:G187)+1)","v":""},2,202,{"$f":"IF(K188=\"\",\"\",IF(COUNTIF(K$135:K187,K188)>0,\"\",COUNTIF(K$135:K$211,K188)))","v":""},{"$f":"IF(INDIRECT(\"Hoja2!F\"&I188)=\"\",\"\",IF(VLOOKUP(INDIRECT(\"Hoja2!F\"&I188),$H$5:$I$131,2,0)=Hoja2!$B$35,\"\",INDIRECT(\"Hoja2!F\"&I188)))","v":""},null,null,4,1,null,"","",null,"","","","","","",null,184,"","","","","",""]
[14319,"SAGRERA Maika","INF-3","VICTT","F",3938.07,{"$f":"IF(J189=\"\",\"\",MAX(G$136:G188)+1)","v":""},3,203,{"$f":"IF(K189=\"\",\"\",IF(COUNTIF(K$135:K188,K189)>0,\"\",COUNTIF(K$135:K$211,K189)))","v":""},{"$f":"IF(INDIRECT(\"Hoja2!F\"&I189)=\"\",\"\",IF(VLOOKUP(INDIRECT(\"Hoja2!F\"&I189),$H$5:$I$131,2,0)=Hoja2!$B$35,\"\",INDIRECT(\"Hoja2!F\"&I189)))","v":""},null,null,4,1,null,"","",null,"","","","","","",null,185,"","","","","",""]
[12868,"TORRENTS Joan","INF-1","VICTT","M",5564.9800000000005,{"$f":"IF(J190=\"\",\"\",MAX(G$136:G189)+1)","v":""},4,204,{"$f":"IF(K190=\"\",\"\",IF(COUNTIF(K$135:K189,K190)>0,\"\",COUNTIF(K$135:K$211,K190)))","v":""},{"$f":"IF(INDIRECT(\"Hoja2!F\"&I190)=\"\",\"\",IF(VLOOKUP(INDIRECT(\"Hoja2!F\"&I190),$H$5:$I$131,2,0)=Hoja2!$B$35,\"\",INDIRECT(\"Hoja2!F\"&I190)))","v":""},null,null,4,1,null,"","",null,"","","","","","",null,186,"",{"$f":"IF(AND($L$1=\"\",$L$2=\"\"),\"\",IF($AA190>$Q$3-$Q$2+1,\"\",VLOOKUP($AA190,$R$5:$Y$600,AC$3,0)))","v":""},"","","",""]
[14009,"TORRENTS Laura","INF-1","VICTT","F",2167.73,{"$f":"IF(J191=\"\",\"\",MAX(G$136:G190)+1)","v":""},5,205,{"$f":"IF(K191=\"\",\"\",IF(COUNTIF(K$135:K190,K191)>0,\"\",COUNTIF(K$135:K$211,K191)))","v":""},{"$f":"IF(INDIRECT(\"Hoja2!F\"&I191)=\"\",\"\",IF(VLOOKUP(INDIRECT(\"Hoja2!F\"&I191),$H$5:$I$131,2,0)=Hoja2!$B$35,\"\",INDIRECT(\"Hoja2!F\"&I191)))","v":""},null,null,4,1,null,"","",null,"","","","","","",null,187,"","","","","",""]
[5870,"BAU Adrià","JUV-3","VICTT","M",5585.4,{"$f":"IF(J192=\"\",\"\",MAX(G$136:G191)+1)","v":""},1,216,{"$f":"IF(K192=\"\",\"\",IF(COUNTIF(K$135:K191,K192)>0,\"\",COUNTIF(K$135:K$211,K192)))","v":""},{"$f":"IF(INDIRECT(\"Hoja2!F\"&I192)=\"\",\"\",IF(VLOOKUP(INDIRECT(\"Hoja2!F\"&I192),$H$5:$I$131,2,0)=Hoja2!$B$35,\"\",INDIRECT(\"Hoja2!F\"&I192)))","v":""},null,null,5,1,null,"","",null,"","","","","","",null,188,"","","","","",""]
[15510,"GIGOSOS Carlos","INF-3","CARDED","M",360.88,{"$f":"IF(J193=\"\",\"\",MAX(G$136:G192)+1)","v":""},2,217,{"$f":"IF(K193=\"\",\"\",IF(COUNTIF(K$135:K192,K193)>0,\"\",COUNTIF(K$135:K$211,K193)))","v":""},{"$f":"IF(INDIRECT(\"Hoja2!F\"&I193)=\"\",\"\",IF(VLOOKUP(INDIRECT(\"Hoja2!F\"&I193),$H$5:$I$131,2,0)=Hoja2!$B$35,\"\",INDIRECT(\"Hoja2!F\"&I193)))","v":""},null,null,4,1,null,"","",null,"","","","","","",null,189,"","","","","",""]
[16344,"ALVAREZ Jan","BEN-2","VILANO","M",4.9800000000000004,{"$f":"IF(J194=\"\",\"\",MAX(G$136:G193)+1)","v":""},3,218,{"$f":"IF(K194=\"\",\"\",IF(COUNTIF(K$135:K193,K194)>0,\"\",COUNTIF(K$135:K$211,K194)))","v":""},{"$f":"IF(INDIRECT(\"Hoja2!F\"&I194)=\"\",\"\",IF(VLOOKUP(INDIRECT(\"Hoja2!F\"&I194),$H$5:$I$131,2,0)=Hoja2!$B$35,\"\",INDIRECT(\"Hoja2!F\"&I194)))","v":""},null,null,2,1,null,"","",null,"","","","","","",null,190,"","","","","",""]
[14917,"PINZANO Ignasi","INF-1","ATEN82","M",858.55,{"$f":"IF(J195=\"\",\"\",MAX(G$136:G194)+1)","v":""},4,219,{"$f":"IF(K195=\"\",\"\",IF(COUNTIF(K$135:K194,K195)>0,\"\",COUNTIF(K$135:K$211,K195)))","v":""},{"$f":"IF(INDIRECT(\"Hoja2!F\"&I195)=\"\",\"\",IF(VLOOKUP(INDIRECT(\"Hoja2!F\"&I195),$H$5:$I$131,2,0)=Hoja2!$B$35,\"\",INDIRECT(\"Hoja2!F\"&I195)))","v":""},null,null,4,1,null,"","",null,"","","","","","",null,191,"","","","","",""]
[14918,"RODRIGUEZ Oscar","ALE-2","ATEN82","M",236.82000000000005,{"$f":"IF(J196=\"\",\"\",MAX(G$136:G195)+1)","v":""},5,220,{"$f":"IF(K196=\"\",\"\",IF(COUNTIF(K$135:K195,K196)>0,\"\",COUNTIF(K$135:K$211,K196)))","v":""},{"$f":"IF(INDIRECT(\"Hoja2!F\"&I196)=\"\",\"\",IF(VLOOKUP(INDIRECT(\"Hoja2!F\"&I196),$H$5:$I$131,2,0)=Hoja2!$B$35,\"\",INDIRECT(\"Hoja2!F\"&I196)))","v":""},null,null,3,1,null,"","",null,"","","","","","",null,192,"","","","","",""]
[13150,"BORDAS Mateu","ALE-2","ATEN82","M",100.37,{"$f":"IF(J197=\"\",\"\",MAX(G$136:G196)+1)","v":""},1,231,{"$f":"IF(K197=\"\",\"\",IF(COUNTIF(K$135:K196,K197)>0,\"\",COUNTIF(K$135:K$211,K197)))","v":""},{"$f":"IF(INDIRECT(\"Hoja2!F\"&I197)=\"\",\"\",IF(VLOOKUP(INDIRECT(\"Hoja2!F\"&I197),$H$5:$I$131,2,0)=Hoja2!$B$35,\"\",INDIRECT(\"Hoja2!F\"&I197)))","v":""},null,null,3,1,null,{"$f":"IF(U197=\"\",\"\",COUNTIF($U$5:$U$600,\"<=\"&$U197))","v":""},{"$f":"IF(Q197=\"\",\"\",Q197-$Q$2+1)","v":""},null,{"$f":"IF(AND($O197=1,OR($L$1=$D197,$L$2=$D197)),A197,\"\")","v":""},{"$f":"IF(AND($O197=1,OR($L$1=$D197,$L$2=$D197)),B197,\"\")","v":""},{"$f":"IF(AND($O197=1,OR($L$1=$D197,$L$2=$D197)),C197,\"\")","v":""},{"$f":"IF(AND($O197=1,OR($L$1=$D197,$L$2=$D197)),D197,\"\")","v":""},{"$f":"IF(AND($O197=1,OR($L$1=$D197,$L$2=$D197)),E197,\"\")","v":""},{"$f":"IF(AND($O197=1,OR($L$1=$D197,$L$2=$D197)),F197,\"\")","v":""},null,193,"","","","","",""]
[14647,"WALLS Juan Manuel","INF-3","ATEN82","M",35.4,{"$f":"IF(J198=\"\",\"\",MAX(G$136:G197)+1)","v":""},2,232,{"$f":"IF(K198=\"\",\"\",IF(COUNTIF(K$135:K197,K198)>0,\"\",COUNTIF(K$135:K$211,K198)))","v":""},{"$f":"IF(INDIRECT(\"Hoja2!F\"&I198)=\"\",\"\",IF(VLOOKUP(INDIRECT(\"Hoja2!F\"&I198),$H$5:$I$131,2,0)=Hoja2!$B$35,\"\",INDIRECT(\"Hoja2!F\"&I198)))","v":""},null,null,{"$f":"VLOOKUP(C198,$K$60:$L$70,2,0)","v":4},{"$f":"IF($L$3=\"\",1,IF($L$3=0,IF(E198=\"F\",1,0),IF(N198<=$L$3,1,0)))","v":1},null,"","",null,"","","","","","",null,{"$f":"AA197+1","v":194},{"$f":"IF(AND($L$1=\"\",$L$2=\"\"),\"\",IF($AA198>$Q$3-$Q$2+1,\"\",VLOOKUP($AA198,$R$5:$Y$600,AB$3,0)))","v":""},"","","","",""]
[15870,"SANCHEZ Oriol","ALE-1","ATEN82","M",83.13,{"$f":"IF(J199=\"\",\"\",MAX(G$136:G198)+1)","v":""},3,233,{"$f":"IF(K199=\"\",\"\",IF(COUNTIF(K$135:K198,K199)>0,\"\",COUNTIF(K$135:K$211,K199)))","v":""},{"$f":"IF(INDIRECT(\"Hoja2!F\"&I199)=\"\",\"\",IF(VLOOKUP(INDIRECT(\"Hoja2!F\"&I199),$H$5:$I$131,2,0)=Hoja2!$B$35,\"\",INDIRECT(\"Hoja2!F\"&I199)))","v":""},null,null,3,1,null,"","",null,"","","","","","",null,195,"","","","","",""]
[14938,"MURGA Roger","INF-3","ATEN82","M",1138.6599999999999,{"$f":"IF(J200=\"\",\"\",MAX(G$136:G199)+1)","v":""},4,234,{"$f":"IF(K200=\"\",\"\",IF(COUNTIF(K$135:K199,K200)>0,\"\",COUNTIF(K$135:K$211,K200)))","v":""},{"$f":"IF(INDIRECT(\"Hoja2!F\"&I200)=\"\",\"\",IF(VLOOKUP(INDIRECT(\"Hoja2!F\"&I200),$H$5:$I$131,2,0)=Hoja2!$B$35,\"\",INDIRECT(\"Hoja2!F\"&I200)))","v":""},null,null,4,1,null,"","",null,"","","","","","",null,196,"",{"$f":"IF(AND($L$1=\"\",$L$2=\"\"),\"\",IF($AA200>$Q$3-$Q$2+1,\"\",VLOOKUP($AA200,$R$5:$Y$600,AC$3,0)))","v":""},"","","",""]
[16399,"LAHOZ Roc","PRE-0","ATEN82","M",11.33,{"$f":"IF(J201=\"\",\"\",MAX(G$136:G200)+1)","v":""},5,235,{"$f":"IF(K201=\"\",\"\",IF(COUNTIF(K$135:K200,K201)>0,\"\",COUNTIF(K$135:K$211,K201)))","v":""},{"$f":"IF(INDIRECT(\"Hoja2!F\"&I201)=\"\",\"\",IF(VLOOKUP(INDIRECT(\"Hoja2!F\"&I201),$H$5:$I$131,2,0)=Hoja2!$B$35,\"\",INDIRECT(\"Hoja2!F\"&I201)))","v":""},null,null,1,1,null,"","",null,"","","","","","",null,197,"","","","","",""]
[14764,"HURTADO Eric","BEN-1","ATEN82","M",19.96,{"$f":"IF(J202=\"\",\"\",MAX(G$136:G201)+1)","v":""},1,246,{"$f":"IF(K202=\"\",\"\",IF(COUNTIF(K$135:K201,K202)>0,\"\",COUNTIF(K$135:K$211,K202)))","v":""},{"$f":"IF(INDIRECT(\"Hoja2!F\"&I202)=\"\",\"\",IF(VLOOKUP(INDIRECT(\"Hoja2!F\"&I202),$H$5:$I$131,2,0)=Hoja2!$B$35,\"\",INDIRECT(\"Hoja2!F\"&I202)))","v":""},null,null,2,1,null,"","",null,"","","","","","",null,198,"","","","","",""]
[15311,"DÍAZ Èric","ALE-1","ATEN82","M",101.77,{"$f":"IF(J203=\"\",\"\",MAX(G$136:G202)+1)","v":""},2,247,{"$f":"IF(K203=\"\",\"\",IF(COUNTIF(K$135:K202,K203)>0,\"\",COUNTIF(K$135:K$211,K203)))","v":""},{"$f":"IF(INDIRECT(\"Hoja2!F\"&I203)=\"\",\"\",IF(VLOOKUP(INDIRECT(\"Hoja2!F\"&I203),$H$5:$I$131,2,0)=Hoja2!$B$35,\"\",INDIRECT(\"Hoja2!F\"&I203)))","v":""},null,null,3,1,null,"","",null,"","","","","","",null,199,"","","","","",""]
[16396,"LIARTE Martí","ALE-2","ATEN82","M",89.96,{"$f":"IF(J204=\"\",\"\",MAX(G$136:G203)+1)","v":""},3,248,{"$f":"IF(K204=\"\",\"\",IF(COUNTIF(K$135:K203,K204)>0,\"\",COUNTIF(K$135:K$211,K204)))","v":""},{"$f":"IF(INDIRECT(\"Hoja2!F\"&I204)=\"\",\"\",IF(VLOOKUP(INDIRECT(\"Hoja2!F\"&I204),$H$5:$I$131,2,0)=Hoja2!$B$35,\"\",INDIRECT(\"Hoja2!F\"&I204)))","v":""},null,null,3,1,null,"","",null,"","","","","","",null,200,"","","","","",""]
[16397,"LIARTE Lluc","BEN-1","ATEN82","M",8,{"$f":"IF(J205=\"\",\"\",MAX(G$136:G204)+1)","v":""},4,249,{"$f":"IF(K205=\"\",\"\",IF(COUNTIF(K$135:K204,K205)>0,\"\",COUNTIF(K$135:K$211,K205)))","v":""},{"$f":"IF(INDIRECT(\"Hoja2!F\"&I205)=\"\",\"\",IF(VLOOKUP(INDIRECT(\"Hoja2!F\"&I205),$H$5:$I$131,2,0)=Hoja2!$B$35,\"\",INDIRECT(\"Hoja2!F\"&I205)))","v":""},null,null,2,1,null,"","",null,"","","","","","",null,201,"","","","","",""]
[13136,"DOMINGUEZ Eric","INF-3","ATEN82","M",559.91,{"$f":"IF(J206=\"\",\"\",MAX(G$136:G205)+1)","v":""},5,250,{"$f":"IF(K206=\"\",\"\",IF(COUNTIF(K$135:K205,K206)>0,\"\",COUNTIF(K$135:K$211,K206)))","v":""},{"$f":"IF(INDIRECT(\"Hoja2!F\"&I206)=\"\",\"\",IF(VLOOKUP(INDIRECT(\"Hoja2!F\"&I206),$H$5:$I$131,2,0)=Hoja2!$B$35,\"\",INDIRECT(\"Hoja2!F\"&I206)))","v":""},null,null,4,1,null,"","",null,"","","","","","",null,202,"","","","","",""]
[15797,"GORCHS Alex","ALE-1","ATEN82","M",124.8,{"$f":"IF(J207=\"\",\"\",MAX(G$136:G206)+1)","v":""},1,261,{"$f":"IF(K207=\"\",\"\",IF(COUNTIF(K$135:K206,K207)>0,\"\",COUNTIF(K$135:K$211,K207)))","v":""},{"$f":"IF(INDIRECT(\"Hoja2!F\"&I207)=\"\",\"\",IF(VLOOKUP(INDIRECT(\"Hoja2!F\"&I207),$H$5:$I$131,2,0)=Hoja2!$B$35,\"\",INDIRECT(\"Hoja2!F\"&I207)))","v":""},null,null,3,1,null,"","",null,"","","","","","",null,203,"","","","","",""]
[16830,"GARRE Marti","ALE-2","MOLLET","M",9.7999999999999989,{"$f":"IF(J208=\"\",\"\",MAX(G$136:G207)+1)","v":""},2,262,{"$f":"IF(K208=\"\",\"\",IF(COUNTIF(K$135:K207,K208)>0,\"\",COUNTIF(K$135:K$211,K208)))","v":""},{"$f":"IF(INDIRECT(\"Hoja2!F\"&I208)=\"\",\"\",IF(VLOOKUP(INDIRECT(\"Hoja2!F\"&I208),$H$5:$I$131,2,0)=Hoja2!$B$35,\"\",INDIRECT(\"Hoja2!F\"&I208)))","v":""},null,null,3,1,null,"","",null,"","","","","","",null,204,"","","","","",""]
[16822,"GARAU Pol","ALE-2","SANTS","M",124.47000000000001,{"$f":"IF(J209=\"\",\"\",MAX(G$136:G208)+1)","v":""},3,263,{"$f":"IF(K209=\"\",\"\",IF(COUNTIF(K$135:K208,K209)>0,\"\",COUNTIF(K$135:K$211,K209)))","v":""},{"$f":"IF(INDIRECT(\"Hoja2!F\"&I209)=\"\",\"\",IF(VLOOKUP(INDIRECT(\"Hoja2!F\"&I209),$H$5:$I$131,2,0)=Hoja2!$B$35,\"\",INDIRECT(\"Hoja2!F\"&I209)))","v":""},null,null,3,1,null,"","",null,"","","","","","",null,205,"","","","","",""]
[16220,"MORENO Oscar","INF-3","SANTS","M",148.82,{"$f":"IF(J210=\"\",\"\",MAX(G$136:G209)+1)","v":""},4,264,{"$f":"IF(K210=\"\",\"\",IF(COUNTIF(K$135:K209,K210)>0,\"\",COUNTIF(K$135:K$211,K210)))","v":""},{"$f":"IF(INDIRECT(\"Hoja2!F\"&I210)=\"\",\"\",IF(VLOOKUP(INDIRECT(\"Hoja2!F\"&I210),$H$5:$I$131,2,0)=Hoja2!$B$35,\"\",INDIRECT(\"Hoja2!F\"&I210)))","v":""},null,null,4,1,null,"","",null,"","","","","","",null,206,"",{"$f":"IF(AND($L$1=\"\",$L$2=\"\"),\"\",IF($AA210>$Q$3-$Q$2+1,\"\",VLOOKUP($AA210,$R$5:$Y$600,AC$3,0)))","v":""},"","","",""]
[16803,"BETRAN Eric","INF-1","SANTS","M",33.22,{"$f":"IF(J211=\"\",\"\",MAX(G$136:G210)+1)","v":""},5,265,{"$f":"IF(K211=\"\",\"\",IF(COUNTIF(K$135:K210,K211)>0,\"\",COUNTIF(K$135:K$211,K211)))","v":""},{"$f":"IF(INDIRECT(\"Hoja2!F\"&I211)=\"\",\"\",IF(VLOOKUP(INDIRECT(\"Hoja2!F\"&I211),$H$5:$I$131,2,0)=Hoja2!$B$35,\"\",INDIRECT(\"Hoja2!F\"&I211)))","v":""},null,null,4,1,null,"","",null,"","","","","","",null,207,"","","","","",""]
[14541,"KUZNETSOV Aleksandr","PRE-0","INDEPE","M",22.47,null,null,null,null,null,null,null,1,1,null,"","",null,"","","","","","",null,208,"","","","","",""]
[14542,"KUZNETSOVA Mariia","INF-1","INDEPE","F",1991.2,null,null,null,null,null,null,null,4,1,null,"","",null,"","","","","","",null,209,"","","","","",""]
[14535,"MARTINEZ Kira","PRE-0","INDEPE","F",20.329999999999998,null,null,45,{"$f":"\"Hoja2!D\"&I214","v":"Hoja2!D45"},{"$f":"IF(INDIRECT(J214)=\"\",\"\",INDIRECT(J214))","v":""},null,null,1,1,null,"","",null,"","","","","","",null,210,"","","","","",""]
[15050,"COFIÑO Luis","INF-1","INDEPE","M",293.58,null,null,{"$f":"I214+15","v":60},{"$f":"\"Hoja2!D\"&I215","v":"Hoja2!D60"},{"$f":"IF(INDIRECT(J215)=\"\",\"\",INDIRECT(J215))","v":""},null,null,4,1,null,"","",null,"","","","","","",null,211,"","","","","",""]
[12518,"SHYPSHA Renata","ALE-2","INDEPE","F",5477.82,null,null,{"$f":"I215+15","v":75},"Hoja2!D75","",null,null,3,1,null,"","",null,"","","","","","",null,212,"","","","","",""]
[16648,"CASANOVAS Pau","BEN-1","INDEPE","M",2.2400000000000002,null,null,90,"Hoja2!D90","",null,null,2,1,null,"","",null,"","","","","","",null,213,"","","","","",""]
[16647,"PÀMIES Roger","BEN-1","INDEPE","M",6.21,null,null,105,"Hoja2!D105","",null,null,2,1,null,"","",null,"","","","","","",null,214,"","","","","",""]
[15231,"BAÑÓ Eladi","PRE-0","INDEPE","M",33.58,null,null,120,"Hoja2!D120","",null,null,1,1,null,"","",null,"","","","","","",null,215,"","","","","",""]
[15233,"BAÑÓ Ireneu","INF-2","INDEPE","M",91.75,null,null,135,"Hoja2!D135","",null,null,4,1,null,"","",null,"","","","","","",null,216,"",{"$f":"IF(AND($L$1=\"\",$L$2=\"\"),\"\",IF($AA220>$Q$3-$Q$2+1,\"\",VLOOKUP($AA220,$R$5:$Y$600,AC$3,0)))","v":""},"","","",""]
[15230,"BAÑÓ Aniol","ALE-2","INDEPE","M",66.319999999999993,null,null,150,"Hoja2!D150","",null,null,3,1,null,"","",null,"","","","","","",null,217,"","","","","",""]
[15045,"BAQUEDANO Bruno","INF-1","INDEPE","M",3851.85,null,null,165,"Hoja2!D165","",null,null,4,1,null,"","",null,"","","","","","",null,218,"","","","","",""]
[15833,"RIGAU Isaac","ALE-2","INDEPE","M",11.219999999999999,null,null,180,"Hoja2!D180","",null,null,3,1,null,"","",null,"","","","","","",null,219,"","","","","",""]
[14891,"PROUS Gerard","INF-1","INDEPE","M",1773.5700000000002,null,null,195,"Hoja2!D195","",null,null,4,1,null,"","",null,"","","","","","",null,220,"","","","","",""]
[13995,"PUJALES Victor","INF-1","INDEPE","M",928.11999999999989,null,null,210,"Hoja2!D210","",null,null,4,1,null,"","",null,"","","","","","",null,221,"","","","","",""]
[15973,"COROBAN Damian","ALE-1","INDEPE","M",10.54,null,null,225,"Hoja2!D225","",null,null,3,1,null,"","",null,"","","","","","",null,222,"","","","","",""]
[14468,"BAKSEJEVA Varvara","BEN-1","INDEPE","F",34.65,null,null,240,"Hoja2!D240","",null,null,2,1,null,"","",null,"","","","","","",null,223,"","","","","",""]
[14538,"NIKOLAEWNA Sofia","BEN-1","INDEPE","F",65.460000000000008,null,null,255,"Hoja2!D255","",null,null,2,1,null,"","",null,"","","","","","",null,224,"","","","","",""]
[15241,"FIGUERAS Jan","INF-1","INDEPE","M",119.08,null,null,null,null,null,null,null,4,1,null,"","",null,"","","","","","",null,225,"","","","","",""]
[15238,"OLLÉ Miquel","ALE-2","INDEPE","M",45.92,null,null,{"$f":"I214+1","v":46},{"$f":"\"Hoja2!D\"&I230","v":"Hoja2!D46"},{"$f":"IF(INDIRECT(J230)=\"\",K214,INDIRECT(J230))","v":""},null,null,3,1,null,"","",null,"","","","","","",null,226,"",{"$f":"IF(AND($L$1=\"\",$L$2=\"\"),\"\",IF($AA230>$Q$3-$Q$2+1,\"\",VLOOKUP($AA230,$R$5:$Y$600,AC$3,0)))","v":""},"","","",""]
[14481,"LOPEZ Iker","INF-1","INDEPE","M",387.96999999999991,null,null,{"$f":"I215+1","v":61},"Hoja2!D61",{"$f":"IF(INDIRECT(J231)=\"\",K215,INDIRECT(J231))","v":""},null,null,4,1,null,"","",null,"","","","","","",null,227,"","","","","",""]
[12403,"ALTAR Pau","INF-3","RIPLET","M",8104.66,null,null,76,"Hoja2!D76","",null,null,4,1,null,"","",null,"","","","","","",null,228,"","","","","",""]
[11771,"ARNAU Ariadna","BEN-2","RIPLET","F",1800.46,null,null,91,"Hoja2!D91","",null,null,2,1,null,"","",null,"","","","","","",null,229,"","","","","",""]
[13635,"BOUCHNAFA Yassir","JUV-2","RIPLET","M",1236.01,null,null,106,"Hoja2!D106","",null,null,5,1,null,"","",null,"","","","","","",null,230,"","","","","",""]
[12820,"CALVO Iker","INF-1","RIPLET","M",1058.3199999999997,null,null,121,"Hoja2!D121","",null,null,4,1,null,"","",null,"","","","","","",null,231,"","","","","",""]
[15431,"CODOLÀ Biel","INF-1","RIPLET","M",1436.27,null,null,136,"Hoja2!D136","",null,null,4,1,null,"","",null,"","","","","","",null,232,"","","","","",""]
[16516,"CODOLÀ Pep","BEN-2","RIPLET","M",7.55,null,null,151,"Hoja2!D151","",null,null,2,1,null,"","",null,"","","","","","",null,233,"","","","","",""]
[11775,"CUTILLAS Octavi","INF-3","RIPLET","M",8724.2199999999993,null,null,166,"Hoja2!D166","",null,null,4,1,null,"","",null,"","","","","","",null,234,"","","","","",""]
[12300,"DOMINGO Carmen","ALE-2","INDEPE","F",3888.21,null,null,181,"Hoja2!D181","",null,null,3,1,null,"","",null,"","","","","","",null,235,"","","","","",""]
[16512,"GARCÍA Ariel","ALE-2","RIPLET","M",22.57,null,null,196,"Hoja2!D196","",null,null,3,1,null,"","",null,"","","","","","",null,236,"",{"$f":"IF(AND($L$1=\"\",$L$2=\"\"),\"\",IF($AA240>$Q$3-$Q$2+1,\"\",VLOOKUP($AA240,$R$5:$Y$600,AC$3,0)))","v":""},"","","",""]
[11774,"GARCÍA Alex","INF-3","RIPLET","M",7249.8600000000006,null,null,211,"Hoja2!D211","",null,null,4,1,null,"","",null,"","","","","","",null,237,"","","","","",""]
[12817,"HERNÁNDEZ Adrià","JUV-1","RIPLET","M",1599.3100000000002,null,null,226,"Hoja2!D226","",null,null,5,1,null,"","",null,"","","","","","",null,238,"","","","","",""]
[13926,"HOMS Pau","INF-2","RIPLET","M",658.1,null,null,241,"Hoja2!D241","",null,null,4,1,null,"","",null,"","","","","","",null,239,"","","","","",""]
[16513,"JANÉ Ot","BEN-2","RIPLET","M",11.6,null,null,256,"Hoja2!D256","",null,null,2,1,null,"","",null,"","","","","","",null,240,"","","","","",""]
[14796,"LLIBRE Alicia","INF-3","RIPLET","F",1073.3399999999999,null,null,null,null,null,null,null,4,1,null,"","",null,"","","","","","",null,241,"","","","","",""]
[16517,"MÉNDEZ Gerard","ALE-1","RIPLET","M",47.25,null,null,47,"Hoja2!D47",{"$f":"IF(INDIRECT(J246)=\"\",\"\",INDIRECT(J246))","v":""},null,null,3,1,null,"","",null,"","","","","","",null,242,"","","","","",""]
[9048,"MORALES Maria","INF-3","RIPLET","F",1302,null,null,62,"Hoja2!D62","",null,null,4,1,null,"","",null,"","","","","","",null,243,"","","","","",""]
[15429,"MUJICA Sergio","INF-1","RIPLET","M",418.06000000000006,null,null,77,"Hoja2!D77","",null,null,4,1,null,"","",null,"","","","","","",null,244,"","","","","",""]
[16514,"PACHECO Liam","BEN-1","RIPLET","M",9.7600000000000016,null,null,92,"Hoja2!D92","",null,null,2,1,null,"","",null,"","","","","","",null,245,"","","","","",""]
[14724,"PARDO Lucas","BEN-1","RIPLET","M",536.05000000000007,null,null,107,"Hoja2!D107","",null,null,2,1,null,"","",null,"","","","","","",null,246,"",{"$f":"IF(AND($L$1=\"\",$L$2=\"\"),\"\",IF($AA250>$Q$3-$Q$2+1,\"\",VLOOKUP($AA250,$R$5:$Y$600,AC$3,0)))","v":""},"","","",""]
[15433,"PEDEMONTE Josep","ALE-2","RIPLET","M",752.34999999999991,null,null,122,"Hoja2!D122","",null,null,3,1,null,"","",null,"","","","","","",null,247,"","","","","",""]
[13491,"PEÑARANDO Leire","ALE-1","RIPLET","F",13.43,null,null,137,"Hoja2!D137","",null,null,3,1,null,"","",null,"","","","","","",null,248,"","","","","",""]
[13490,"PEÑARANDO Lídia","INF-2","RIPLET","F",352.74000000000007,null,null,152,"Hoja2!D152","",null,null,4,1,null,"","",null,"","","","","","",null,249,"","","","","",""]
[15441,"PIMENTEL Luis Guillermo","ALE-1","RIPLET","M",440.26,null,null,167,"Hoja2!D167","",null,null,3,1,null,"","",null,"","","","","","",null,250,"","","","","",""]
[15432,"QUESADA Pedro Pablo","INF-2","RIPLET","M",775.43999999999994,null,null,182,"Hoja2!D182","",null,null,4,1,null,"","",null,"","","","","","",null,251,"","","","","",""]
[11640,"ROS Guillem","ALE-2","RIPLET","M",3151.85,null,null,197,"Hoja2!D197","",null,null,3,1,null,"","",null,"","","","","","",null,252,"","","","","",""]
[16523,"SASSOT Juan Antonio","ALE-2","RIPLET","M",28.43,null,null,212,"Hoja2!D212","",null,null,3,1,null,"","",null,"","","","","","",null,253,"","","","","",""]
[10912,"SILVA Adrian","INF-3","RIPLET","M",5885.93,null,null,227,"Hoja2!D227","",null,null,4,1,null,"","",null,"","","","","","",null,254,"","","","","",""]
[16524,"TOMAS Unai","BEN-1","RIPLET","M",10.290000000000001,null,null,242,"Hoja2!D242","",null,null,2,1,null,"","",null,"","","","","","",null,255,"","","","","",""]
[16790,"FLUVIA Leo","BEN-1","RIPLET","M",10.54,null,null,257,"Hoja2!D257","",null,null,2,1,null,"","",null,"","","","","","",null,256,"",{"$f":"IF(AND($L$1=\"\",$L$2=\"\"),\"\",IF($AA260>$Q$3-$Q$2+1,\"\",VLOOKUP($AA260,$R$5:$Y$600,AC$3,0)))","v":""},"","","",""]
[15634,"ISERN Jan Ziad","ALE-2","LLUÏSO","M",230.70000000000002,null,null,null,null,null,null,null,3,1,null,{"$f":"IF(U261=\"\",\"\",COUNTIF($U$5:$U$600,\"<=\"&$U261))","v":""},{"$f":"IF(Q261=\"\",\"\",Q261-$Q$2+1)","v":""},null,{"$f":"IF(AND($O261=1,OR($L$1=$D261,$L$2=$D261)),A261,\"\")","v":""},{"$f":"IF(AND($O261=1,OR($L$1=$D261,$L$2=$D261)),B261,\"\")","v":""},{"$f":"IF(AND($O261=1,OR($L$1=$D261,$L$2=$D261)),C261,\"\")","v":""},{"$f":"IF(AND($O261=1,OR($L$1=$D261,$L$2=$D261)),D261,\"\")","v":""},{"$f":"IF(AND($O261=1,OR($L$1=$D261,$L$2=$D261)),E261,\"\")","v":""},{"$f":"IF(AND($O261=1,OR($L$1=$D261,$L$2=$D261)),F261,\"\")","v":""},null,257,"","","","","",""]
[16494,"ULLOA Adrià","JUV-1","LLUÏSO","M",135.88,null,null,0,1,2,3,4,{"$f":"VLOOKUP(C262,$K$60:$L$70,2,0)","v":5},{"$f":"IF($L$3=\"\",1,IF($L$3=0,IF(E262=\"F\",1,0),IF(N262<=$L$3,1,0)))","v":1},null,"","",null,"","","","","","",null,{"$f":"AA261+1","v":258},{"$f":"IF(AND($L$1=\"\",$L$2=\"\"),\"\",IF($AA262>$Q$3-$Q$2+1,\"\",VLOOKUP($AA262,$R$5:$Y$600,AB$3,0)))","v":""},"","","","",""]
[15585,"BEL Iker","INF-3","LLUÏSO","M",472.76000000000005,null,51,{"$f":"IF(INDIRECT(\"Hoja2!B\"&$H263+I$262)=\"\",\"\",INDIRECT(\"Hoja2!B\"&$H263+I$262))","v":""},{"$f":"IF(INDIRECT(\"Hoja2!B\"&$H263+J$262)=\"\",\"\",INDIRECT(\"Hoja2!B\"&$H263+J$262))","v":""},{"$f":"IF(INDIRECT(\"Hoja2!B\"&$H263+K$262)=\"\",\"\",INDIRECT(\"Hoja2!B\"&$H263+K$262))","v":""},"","",4,1,null,"","",null,"","","","","","",null,259,"","","","","",""]
[16500,"FAHERTY Santiago","INF-3","LLUÏSO","M",0,null,{"$f":"H263+15","v":66},"","","","","",4,1,null,"","",null,"","","","","","",null,260,"","","","","",""]
[12446,"MOREU Raimon","JUV-1","LLUÏSO","M",125.05,null,81,"","","","","",5,1,null,"","",null,"","","","","","",null,261,"","","","","",""]
[13170,"ANDREU Henok","JUV-2","LLUÏSO","M",114.16,null,96,"","","","","",5,1,null,"","",null,"","","","","","",null,262,"","","","","",""]
[15080,"CASTILLO Pol","BEN-2","LLUÏSO","M",201.17000000000004,null,111,"","","","","",2,1,null,"","",null,"","","","","","",null,263,"","","","","",""]
[15078,"BOLOIX Cesc","INF-1","LLUÏSO","M",1455.8000000000002,null,126,"","","","","",4,1,null,"","",null,"","","","","","",null,264,"","","","","",""]
[15077,"AIGNER Max","INF-1","LLUÏSO","M",638.33999999999992,null,141,"","","","","",4,1,null,"","",null,"","","","","","",null,265,"","","","","",""]
[15075,"LLORENS Teo","INF-1","LLUÏSO","M",2020.52,null,156,"","","","","",4,1,null,"","",null,"","","","","","",null,266,"",{"$f":"IF(AND($L$1=\"\",$L$2=\"\"),\"\",IF($AA270>$Q$3-$Q$2+1,\"\",VLOOKUP($AA270,$R$5:$Y$600,AC$3,0)))","v":""},"","","",""]
[13478,"CARMONA Daniel","BEN-2","LLUÏSO","M",1569.6100000000001,null,171,"","","","","",2,1,null,"","",null,"","","","","","",null,267,"","","","","",""]
[16496,"DELRIU Jan","INF-2","LLUÏSO","M",316.68,null,186,"","","","","",4,1,null,"","",null,"","","","","","",null,268,"","","","","",""]
[14441,"MASIP Alex","INF-2","LLUÏSO","M",810,null,201,"","","","","",4,1,null,"","",null,"","","","","","",null,269,"","","","","",""]
[16797,"COLL Elies","INF-1","LLUÏSO","M",215.17,null,216,"","","","","",4,1,null,"","",null,"","","","","","",null,270,"","","","","",""]
[13593,"RUIZ Guillem","INF-1","LLUÏSO","M",2505.5100000000002,null,231,"","","","","",4,1,null,"","",null,"","","","","","",null,271,"","","","","",""]
[15591,"GASULL Aran","INF-3","LLUÏSO","M",261.86,null,246,"","","","","",4,1,null,"","",null,"","","","","","",null,272,"","","","","",""]
[15593,"AMAT Jofre","BEN-1","LLUÏSO","M",125.86,null,261,"","","","","",2,1,null,"","",null,"","","","","","",null,273,"","","","","",""]
[15978,"ESCODA Guim","PRE-0","LLUÏSO","M",0.13,null,null,null,null,null,null,null,1,1,null,"","",null,"","","","","","",null,274,"","","","","",""]
[15592,"MIQUEL Pau","ALE-2","LLUÏSO","M",154.82999999999998,null,null,{"$f":"I246-4","v":43},{"$f":"\"Hoja2!F\"&I279","v":"Hoja2!F43"},{"$f":"IF(INDIRECT(J279)=\"\",\"\",INDIRECT(J279))","v":"INSCRIPCIÓ EN BLANC"},null,null,3,1,null,"","",null,"","","","","","",null,275,"","","","","",""]
[16811,"NADAL Jan","ALE-2","LLUÏSO","M",43.79,null,null,{"$f":"I247-4","v":58},{"$f":"\"Hoja2!F\"&I280","v":"Hoja2!F58"},"INSCRIPCIÓ EN BLANC",null,null,3,1,null,"","",null,"","","","","","",null,276,"",{"$f":"IF(AND($L$1=\"\",$L$2=\"\"),\"\",IF($AA280>$Q$3-$Q$2+1,\"\",VLOOKUP($AA280,$R$5:$Y$600,AC$3,0)))","v":""},"","","",""]
[16812,"RIU Miquel","BEN-1","LLUÏSO","M",33.56,null,null,73,"Hoja2!F73","INSCRIPCIÓ EN BLANC",null,null,2,1,null,"","",null,"","","","","","",null,277,"","","","","",""]
[16813,"CHAYROUSSE Marçal","ALE-2","LLUÏSO","M",78.139999999999986,null,null,88,"Hoja2!F88","INSCRIPCIÓ EN BLANC",null,null,3,1,null,"","",null,"","","","","","",null,278,"","","","","",""]
[16820,"CASALS Toni","ALE-1","LLUÏSO","M",29.95,null,null,103,"Hoja2!F103","INSCRIPCIÓ EN BLANC",null,null,3,1,null,"","",null,"","","","","","",null,279,"","","","","",""]
[16814,"LAMICH Bruno","ALE-1","LLUÏSO","M",17.309999999999999,null,null,118,"Hoja2!F118","INSCRIPCIÓ EN BLANC",null,null,3,1,null,"","",null,"","","","","","",null,280,"","","","","",""]
[16815,"ZAFRA Bruno","INF-1","LLUÏSO","M",181.06,null,null,133,"Hoja2!F133","INSCRIPCIÓ EN BLANC",null,null,4,1,null,"","",null,"","","","","","",null,281,"","","","","",""]
[16816,"PINTOR Pol","ALE-2","LLUÏSO","M",0,null,null,148,"Hoja2!F148","INSCRIPCIÓ EN BLANC",null,null,3,1,null,"","",null,"","","","","","",null,282,"","","","","",""]
[16817,"PINTOR Biel","INF-2","LLUÏSO","M",0,null,null,163,"Hoja2!F163","INSCRIPCIÓ EN BLANC",null,null,4,1,null,"","",null,"","","","","","",null,283,"","","","","",""]
[16818,"SANCHIS Joan","INF-3","LLUÏSO","M",48.98,null,null,178,"Hoja2!F178","INSCRIPCIÓ EN BLANC",null,null,4,1,null,"","",null,"","","","","","",null,284,"","","","","",""]
[16819,"KAM Isaac","INF-2","LLUÏSO","M",110.69,null,null,193,"Hoja2!F193","INSCRIPCIÓ EN BLANC",null,null,4,1,null,"","",null,"","","","","","",null,285,"","","","","",""]
[16821,"MORENO Leo","ALE-2","LLUÏSO","M",16.97,null,null,208,"Hoja2!F208","INSCRIPCIÓ EN BLANC",null,null,3,1,null,"","",null,"","","","","","",null,286,"",{"$f":"IF(AND($L$1=\"\",$L$2=\"\"),\"\",IF($AA290>$Q$3-$Q$2+1,\"\",VLOOKUP($AA290,$R$5:$Y$600,AC$3,0)))","v":""},"","","",""]
[16834,"BORGOS-PIEPER Ayrton","INF-1","LLUÏSO","M",4.75,null,null,223,"Hoja2!F223","INSCRIPCIÓ EN BLANC",null,null,4,1,null,"","",null,"","","","","","",null,287,"","","","","",""]
[14179,"CARACUEL Daniel","ALE-1","AMICS","M",1445.1399999999999,null,null,238,"Hoja2!F238","INSCRIPCIÓ EN BLANC",null,null,3,1,null,"","",null,"","","","","","",null,288,"","","","","",""]
[10853,"MAMPEL Ramon","ALE-1","AMICS","M",1935.21,null,null,253,"Hoja2!F253","INSCRIPCIÓ EN BLANC",null,null,3,1,null,"","",null,"","","","","","",null,289,"","","","","",""]
[14947,"HERNANDEZ Eder","INF-3","AMICS","M",2714.5,null,null,null,null,null,null,null,4,1,null,"","",null,"","","","","","",null,290,"","","","","",""]
[10859,"GARCÍA Albert","INF-1","AMICS","M",1026.03,null,null,null,null,null,null,null,4,1,null,"","",null,"","","","","","",null,291,"","","","","",""]
[16835,"CANADELL Santiago","INF-1","AMICS","M",60.920000000000009,null,null,{"$f":"I246+1","v":48},{"$f":"\"Hoja2!D\"&I296","v":"Hoja2!D48"},{"$f":"IF(INDIRECT(J296)=\"\",\"\",INDIRECT(J296))","v":""},null,null,4,1,null,"","",null,"","","","","","",null,292,"","","","","",""]
[15226,"MESTRAS Josep","INF-1","CTTBCN","M",15.82,null,null,{"$f":"I247+1","v":63},"Hoja2!D63","",null,null,4,1,null,"","",null,"","","","","","",null,293,"","","","","",""]
[15248,"VALLES Pau","INF-1","CTTBCN","M",103.80999999999999,null,null,78,"Hoja2!D78","",null,null,4,1,null,"","",null,"","","","","","",null,294,"","","","","",""]
[15247,"ESTRUCH Ramon","INF-3","CTTBCN","M",240.42000000000002,null,null,93,"Hoja2!D93","",null,null,4,1,null,"","",null,"","","","","","",null,295,"","","","","",""]
[14817,"MARTIN Arnau","INF-3","CTTBCN","M",847.17000000000007,null,null,108,"Hoja2!D108","",null,null,4,1,null,"","",null,"","","","","","",null,296,"",{"$f":"IF(AND($L$1=\"\",$L$2=\"\"),\"\",IF($AA300>$Q$3-$Q$2+1,\"\",VLOOKUP($AA300,$R$5:$Y$600,AC$3,0)))","v":""},"","","",""]
[15250,"RULL Blai","ALE-2","CTTBCN","M",222.57,null,null,123,"Hoja2!D123","",null,null,3,1,null,"","",null,"","","","","","",null,297,"","","","","",""]
[11487,"DONALDSON Mike","INF-3","CTTBCN","M",1849.53,null,null,138,"Hoja2!D138","",null,null,4,1,null,"","",null,"","","","","","",null,298,"","","","","",""]
[13971,"ZHOU Yu","BEN-2","CTTBCN","M",855.93999999999994,null,null,153,"Hoja2!D153","",null,null,2,1,null,"","",null,"","","","","","",null,299,"","","","","",""]
[13606,"RODRIGUEZ Leo","INF-2","CTTBCN","M",3865.4600000000005,null,null,168,"Hoja2!D168","",null,null,4,1,null,"","",null,"","","","","","",null,300,"","","","","",""]
[10640,"CARLES Pol","JUV-1","CTTBCN","M",1998.13,null,null,183,"Hoja2!D183","",null,null,5,1,null,"","",null,"","","","","","",null,301,"","","","","",""]
[11814,"FUSTER Diego","INF-3","CTTBCN","M",6355.7000000000007,null,null,198,"Hoja2!D198","",null,null,4,1,null,"","",null,"","","","","","",null,302,"","","","","",""]
[11984,"GAVIRA Raphael Noah","INF-2","CTTBCN","M",1903.55,null,null,213,"Hoja2!D213","",null,null,4,1,null,"","",null,"","","","","","",null,303,"","","","","",""]
[11821,"MESTRE Lluc","INF-3","CTTBCN","M",4364.87,null,null,228,"Hoja2!D228","",null,null,4,1,null,"","",null,"","","","","","",null,304,"","","","","",""]
[11633,"VANACLOCHA Santi","JUV-2","CTTBCN","M",7880.85,null,null,243,"Hoja2!D243","",null,null,5,1,null,"","",null,"","","","","","",null,305,"","","","","",""]
[8150,"LANDAJO Eric","JUV-3","CTTBCN","M",4136.3100000000004,null,null,258,"Hoja2!D258","",null,null,5,1,null,"","",null,"","","","","","",null,306,"",{"$f":"IF(AND($L$1=\"\",$L$2=\"\"),\"\",IF($AA310>$Q$3-$Q$2+1,\"\",VLOOKUP($AA310,$R$5:$Y$600,AC$3,0)))","v":""},"","","",""]
[6661,"LEONE Mateo","ALE-2","CALEL","M",6381.2,null,null,null,null,null,null,null,3,1,null,"","",null,"","","","","","",null,307,"","","","","",""]
[11254,"RUSCALLEDA Antoni","ALE-1","CALEL","M",6090.12,null,null,null,null,null,null,null,3,1,null,"","",null,"","","","","","",null,308,"","","","","",""]
[10228,"MARTÍNEZ Maria","ALE-2","CALEL","F",2086.0500000000002,null,null,null,null,null,null,null,3,1,null,"","",null,"","","","","","",null,309,"","","","","",""]
[6764,"FONT Laia","ALE-2","CALEL","F",2722.8999999999996,null,null,null,null,null,null,null,3,1,null,"","",null,"","","","","","",null,310,"","","","","",""]
[13802,"REJANO Arnau","INF-3","CALEL","M",1454,null,null,null,null,null,null,null,4,1,null,"","",null,"","","","","","",null,311,"","","","","",""]
[13743,"COLOMINAS Ivet","INF-2","CALEL","F",1480.67,null,null,null,null,null,null,null,4,1,null,"","",null,"","","","","","",null,312,"","","","","",""]
[14062,"FERNÁNDEZ U. Marc","INF-3","CALEL","M",870.6,null,null,null,null,null,null,null,4,1,null,"","",null,"","","","","","",null,313,"","","","","",""]
[14230,"SOLE Pau","JUV-1","CALEL","M",2487.34,null,null,null,null,null,null,null,5,1,null,"","",null,"","","","","","",null,314,"","","","","",""]
[9039,"RODRIGUEZ Esteban","INF-3","CALEL","M",433.47,null,null,null,null,null,null,null,4,1,null,"","",null,"","","","","","",null,315,"","","","","",""]
[15508,"TORRENT Pau","ALE-2","CALEL","M",1737.29,null,null,null,null,null,null,null,3,1,null,"","",null,"","","","","","",null,316,"",{"$f":"IF(AND($L$1=\"\",$L$2=\"\"),\"\",IF($AA320>$Q$3-$Q$2+1,\"\",VLOOKUP($AA320,$R$5:$Y$600,AC$3,0)))","v":""},"","","",""]
[15003,"PERA Arnau","ALE-2","CALEL","M",1225.3899999999999,null,null,null,null,null,null,null,3,1,null,"","",null,"","","","","","",null,317,"","","","","",""]
[14586,"COLL Miquel","ALE-2","CALEL","M",115.78,null,null,null,null,null,null,null,3,1,null,"","",null,"","","","","","",null,318,"","","","","",""]
[15501,"CAPARRÓS Ainoa","BEN-2","CALEL","F",359.56,null,null,null,null,null,null,null,2,1,null,"","",null,"","","","","","",null,319,"","","","","",""]
[14482,"NOORDERMEER Chloe","BEN-2","CALEL","F",53.55,null,null,null,null,null,null,null,2,1,null,"","",null,"","","","","","",null,320,"","","","","",""]
[15005,"LÓPEZ Victor","ALE-2","CALEL","M",33.35,null,null,null,null,null,null,null,3,1,null,{"$f":"IF(U325=\"\",\"\",COUNTIF($U$5:$U$600,\"<=\"&$U325))","v":""},{"$f":"IF(Q325=\"\",\"\",Q325-$Q$2+1)","v":""},null,{"$f":"IF(AND($O325=1,OR($L$1=$D325,$L$2=$D325)),A325,\"\")","v":""},{"$f":"IF(AND($O325=1,OR($L$1=$D325,$L$2=$D325)),B325,\"\")","v":""},{"$f":"IF(AND($O325=1,OR($L$1=$D325,$L$2=$D325)),C325,\"\")","v":""},{"$f":"IF(AND($O325=1,OR($L$1=$D325,$L$2=$D325)),D325,\"\")","v":""},{"$f":"IF(AND($O325=1,OR($L$1=$D325,$L$2=$D325)),E325,\"\")","v":""},{"$f":"IF(AND($O325=1,OR($L$1=$D325,$L$2=$D325)),F325,\"\")","v":""},null,321,"","","","","",""]
[15499,"FANDIÑO Arnau","ALE-2","CALEL","M",58.31,null,null,null,null,null,null,null,{"$f":"VLOOKUP(C326,$K$60:$L$70,2,0)","v":3},{"$f":"IF($L$3=\"\",1,IF($L$3=0,IF(E326=\"F\",1,0),IF(N326<=$L$3,1,0)))","v":1},null,"","",null,"","","","","","",null,{"$f":"AA325+1","v":322},{"$f":"IF(AND($L$1=\"\",$L$2=\"\"),\"\",IF($AA326>$Q$3-$Q$2+1,\"\",VLOOKUP($AA326,$R$5:$Y$600,AB$3,0)))","v":""},"","","","",""]
[16836,"SALAN Nil","PRE-0","CALEL","M",14.03,null,null,null,null,null,null,null,1,1,null,"","",null,"","","","","","",null,323,"","","","","",""]
[16841,"CANU Shasha","INF-1","ATEPN","M",26.939999999999998,null,null,null,null,null,null,null,4,1,null,"","",null,"","","","","","",null,324,"","","","","",""]
[16840,"FAMADES Oleguer","INF-1","ATEPN","M",71.94,null,null,null,null,null,null,null,4,1,null,"","",null,"","","","","","",null,325,"","","","","",""]
[16839,"ANDREU Pau","INF-1","ATEPN","M",57.580000000000005,null,null,null,null,null,null,null,4,1,null,"","",null,"","","","","","",null,326,"",{"$f":"IF(AND($L$1=\"\",$L$2=\"\"),\"\",IF($AA330>$Q$3-$Q$2+1,\"\",VLOOKUP($AA330,$R$5:$Y$600,AC$3,0)))","v":""},"","","",""]
[16838,"PLANAS Joel","INF-3","ATEPN","M",220.8,null,null,null,null,null,null,null,4,1,null,"","",null,"","","","","","",null,327,"","","","","",""]
[16837,"LOPEZ-DURAN Marc","INF-1","ATEPN","M",63.87,null,null,null,null,null,null,null,4,1,null,"","",null,"","","","","","",null,328,"","","","","",""]
[13843,"CASTRO Marco Andres","ALE-2","ATEPN","M",81.210000000000008,null,null,null,null,null,null,null,3,1,null,"","",null,"","","","","","",null,329,"","","","","",""]
[14355,"MURILLO Pau","INF-1","ATEPN","M",846.40999999999985,null,null,null,null,null,null,null,4,1,null,"","",null,"","","","","","",null,330,"","","","","",""]
[16380,"LÓPEZ David","INF-3","ESPARR","M",201.41000000000003,null,null,null,null,null,null,null,4,1,null,"","",null,"","","","","","",null,331,"","","","","",""]
[13022,"CABRERA Iker","ALE-1","ESPARR","M",909.81999999999994,null,null,null,null,null,null,null,3,1,null,"","",null,"","","","","","",null,332,"","","","","",""]
[8990,"NOGUERO Eric","INF-2","ESPARR","M",209.95,null,null,null,null,null,null,null,4,1,null,"","",null,"","","","","","",null,333,"","","","","",""]
[16535,"PÉREZ Lucas","INF-1","ESPARR","M",447.36999999999995,null,null,null,null,null,null,null,4,1,null,"","",null,"","","","","","",null,334,"","","","","",""]
[16534,"SÁNCHEZ Carla","ALE-1","ESPARR","F",9.58,null,null,null,null,null,null,null,3,1,null,"","",null,"","","","","","",null,335,"","","","","",""]
[16379,"SÁNCHEZ Alex","INF-1","ESPARR","M",38.549999999999997,null,null,null,null,null,null,null,4,1,null,"","",null,"","","","","","",null,336,"",{"$f":"IF(AND($L$1=\"\",$L$2=\"\"),\"\",IF($AA340>$Q$3-$Q$2+1,\"\",VLOOKUP($AA340,$R$5:$Y$600,AC$3,0)))","v":""},"","","",""]
[16179,"LÓPEZ Carlos","BEN-2","ESPARR","M",2.5,null,null,null,null,null,null,null,2,1,null,"","",null,"","","","","","",null,337,"","","","","",""]
[16381,"BORRÀS Pau","ALE-1","ESPARR","M",13.219999999999999,null,null,null,null,null,null,null,3,1,null,"","",null,"","","","","","",null,338,"","","","","",""]
[14235,"JORQUERA Simó","INF-3","ESPARR","M",3531.12,null,null,null,null,null,null,null,4,1,null,"","",null,"","","","","","",null,339,"","","","","",""]
[11856,"NEVADO Samuel","INF-2","ESPARR","M",6268.5,null,null,null,null,null,null,null,4,1,null,"","",null,"","","","","","",null,340,"","","","","",""]
[12977,"SORRIBES Vica","ALE-2","ESPARR","F",372.41999999999996,null,null,null,null,null,null,null,3,1,null,"","",null,"","","","","","",null,341,"","","","","",""]
[13369,"AMANTIA Liam","ALE-1","BADALO","M",2395.83,null,null,null,null,null,null,null,3,1,null,"","",null,"","","","","","",null,342,"","","","","",""]
[14223,"GRANADOS Joan","BEN-2","BADALO","M",4179.25,null,null,null,null,null,null,null,2,1,null,"","",null,"","","","","","",null,343,"","","","","",""]
[14988,"LUCAS Pablo","INF-2","BADALO","M",6307.9,null,null,null,null,null,null,null,4,1,null,"","",null,"","","","","","",null,344,"","","","","",""]
[12491,"NAVARRO Arnau","JUV-1","BADALO","M",4966.8500000000004,null,null,null,null,null,null,null,5,1,null,"","",null,"","","","","","",null,345,"","","","","",""]
[11283,"RAVENTÓS Arnau","JUV-1","BADALO","M",10663.34,null,null,null,null,null,null,null,5,1,null,"","",null,"","","","","","",null,346,"",{"$f":"IF(AND($L$1=\"\",$L$2=\"\"),\"\",IF($AA350>$Q$3-$Q$2+1,\"\",VLOOKUP($AA350,$R$5:$Y$600,AC$3,0)))","v":""},"","","",""]
[12059,"REQUENA Saúl","JUV-2","BADALO","M",7930.46,null,null,null,null,null,null,null,5,1,null,"","",null,"","","","","","",null,347,"","","","","",""]
[15124,"FERNÀNDEZ Hugo","INF-2","BADALO","M",1136.9399999999998,null,null,null,null,null,null,null,4,1,null,"","",null,"","","","","","",null,348,"","","","","",""]
[14733,"LAVADO Dídac","INF-1","BADALO","M",909.15,null,null,null,null,null,null,null,4,1,null,"","",null,"","","","","","",null,349,"","","","","",""]
[15676,"LÓPEZ Guillem","INF-3","BADALO","M",477.58000000000004,null,null,null,null,null,null,null,4,1,null,"","",null,"","","","","","",null,350,"","","","","",""]
[14077,"NÚÑEZ Pol","INF-1","BADALO","M",3743.77,null,null,null,null,null,null,null,4,1,null,"","",null,"","","","","","",null,351,"","","","","",""]
[15180,"SORIANO Mario","INF-2","BADALO","M",1335.27,null,null,null,null,null,null,null,4,1,null,"","",null,"","","","","","",null,352,"","","","","",""]
[15939,"COMÍN Mario","ALE-2","BADALO","M",159.94,null,null,null,null,null,null,null,3,1,null,"","",null,"","","","","","",null,353,"","","","","",""]
[15013,"GRILLO Manel","ALE-1","BADALO","M",582.01,null,null,null,null,null,null,null,3,1,null,"","",null,"","","","","","",null,354,"","","","","",""]
[15317,"MARCO Yuri","INF-2","BADALO","M",39.22,null,null,null,null,null,null,null,4,1,null,"","",null,"","","","","","",null,355,"","","","","",""]
[15213,"RANGEL Unai","ALE-2","BADALO","M",47.7,null,null,null,null,null,null,null,3,1,null,"","",null,"","","","","","",null,356,"",{"$f":"IF(AND($L$1=\"\",$L$2=\"\"),\"\",IF($AA360>$Q$3-$Q$2+1,\"\",VLOOKUP($AA360,$R$5:$Y$600,AC$3,0)))","v":""},"","","",""]
[16270,"SÁNCHEZ Pol","INF-1","BADALO","M",124.35,null,null,null,null,null,null,null,4,1,null,"","",null,"","","","","","",null,357,"","","","","",""]
[14597,"TORRENTE Eudald","BEN-2","BADALO","M",318.56000000000006,null,null,null,null,null,null,null,2,1,null,"","",null,"","","","","","",null,358,"","","","","",""]
[15315,"URENDEZ Unai","INF-2","BADALO","M",222.32999999999998,null,null,null,null,null,null,null,4,1,null,"","",null,"","","","","","",null,359,"","","","","",""]
[15112,"GARAY Arnau","INF-3","BADALO","M",12.99,null,null,null,null,null,null,null,4,1,null,"","",null,"","","","","","",null,360,"","","","","",""]
[15121,"LAGUNA Nil","JUV-2","BADALO","M",145.13,null,null,null,null,null,null,null,5,1,null,"","",null,"","","","","","",null,361,"","","","","",""]
[16159,"PALLEJA Marc","ALE-2","BADALO","M",24.06,null,null,null,null,null,null,null,3,1,null,"","",null,"","","","","","",null,362,"","","","","",""]
[16063,"REPULLO Javier","INF-2","BADALO","M",36.000000000000007,null,null,null,null,null,null,null,4,1,null,"","",null,"","","","","","",null,363,"","","","","",""]
[15912,"FERNÁNDEZ F. Marc","ALE-2","BADALO","M",33.690000000000005,null,null,null,null,null,null,null,3,1,null,"","",null,"","","","","","",null,364,"","","","","",""]
[15858,"LÓPEZ Martí","INF-1","BADALO","M",56.44,null,null,null,null,null,null,null,4,1,null,"","",null,"","","","","","",null,365,"","","","","",""]
[16131,"PÉREZ Joan","ALE-2","BADALO","M",29.409999999999997,null,null,null,null,null,null,null,3,1,null,"","",null,"","","","","","",null,366,"",{"$f":"IF(AND($L$1=\"\",$L$2=\"\"),\"\",IF($AA370>$Q$3-$Q$2+1,\"\",VLOOKUP($AA370,$R$5:$Y$600,AC$3,0)))","v":""},"","","",""]
[15800,"PRIETO Frank","BEN-2","BADALO","M",1.25,null,null,null,null,null,null,null,2,1,null,"","",null,"","","","","","",null,367,"","","","","",""]
[16127,"RAVENTÓS Martina","ALE-1","BADALO","F",2.5,null,null,null,null,null,null,null,3,1,null,"","",null,"","","","","","",null,368,"","","","","",""]
[7239,"MARTINEZ Arnau","JUV-2","INDEPE","M",1283.1499999999999,null,null,null,null,null,null,null,5,1,null,"","",null,"","","","","","",null,369,"","","","","",""]
[13542,"SAÑUDO Joel","INF-2","VILASS","M",730.7700000000001,null,null,null,null,null,null,null,4,1,null,"","",null,"","","","","","",null,370,"","","","","",""]
[15577,"FERNÁNDEZ Adria","INF-1","MOLINS","M",1326.45,null,null,null,null,null,null,null,4,1,null,"","",null,"","","","","","",null,371,"","","","","",""]
[15793,"SÁEZ Daniel","ALE-1","MOLINS","M",16.23,null,null,null,null,null,null,null,3,1,null,"","",null,"","","","","","",null,372,"","","","","",""]
[15580,"LLUCH Gerard","INF-1","MOLINS","M",414.92,null,null,null,null,null,null,null,4,1,null,"","",null,"","","","","","",null,373,"","","","","",""]
[16842,"FABREGAS Pol","INF-1","MOLINS","M",7.17,null,null,null,null,null,null,null,4,1,null,"","",null,"","","","","","",null,374,"","","","","",""]
[16571,"ALONSO Oleguer","INF-2","MASQUE","M",13.25,null,null,null,null,null,null,null,4,1,null,"","",null,"","","","","","",null,375,"","","","","",""]
[16569,"NOTARIO Biel","INF-2","MASQUE","M",46.68,null,null,null,null,null,null,null,4,1,null,"","",null,"","","","","","",null,376,"",{"$f":"IF(AND($L$1=\"\",$L$2=\"\"),\"\",IF($AA380>$Q$3-$Q$2+1,\"\",VLOOKUP($AA380,$R$5:$Y$600,AC$3,0)))","v":""},"","","",""]
[16568,"CABAN Ariel","INF-1","MASQUE","M",28.99,null,null,null,null,null,null,null,4,1,null,"","",null,"","","","","","",null,377,"","","","","",""]
[16567,"PEÑA Mario","ALE-1","MASQUE","M",29.26,null,null,null,null,null,null,null,3,1,null,"","",null,"","","","","","",null,378,"","","","","",""]
[14192,"LÓPEZ Leire","BEN-2","MASQUE","F",37.35,null,null,null,null,null,null,null,2,1,null,"","",null,"","","","","","",null,379,"","","","","",""]
[15066,"SILES Isaac","ALE-1","MASQUE","M",10.469999999999999,null,null,null,null,null,null,null,3,1,null,"","",null,"","","","","","",null,380,"","","","","",""]
[16415,"CASQUERO Daniel","PRE-0","ESPARR","M",43.39,null,null,null,null,null,null,null,1,1,null,"","",null,"","","","","","",null,381,"","","","","",""]
[16414,"CASQUERO Eric","INF-1","ESPARR","M",649.59,null,null,null,null,null,null,null,4,1,null,"","",null,"","","","","","",null,382,"","","","","",""]
[16412,"PÉREZ Jan","INF-1","MASQUE","M",23.25,null,null,null,null,null,null,null,4,1,null,"","",null,"","","","","","",null,383,"","","","","",""]
[15067,"SILES Júlia","INF-1","MASQUE","F",23.46,null,null,null,null,null,null,null,4,1,null,"","",null,"","","","","","",null,384,"","","","","",""]
[15401,"CORTÉS Iker","INF-1","S.CUGA","M",31.060000000000002,null,null,null,null,null,null,null,4,1,null,{"$f":"IF(U389=\"\",\"\",COUNTIF($U$5:$U$600,\"<=\"&$U389))","v":""},{"$f":"IF(Q389=\"\",\"\",Q389-$Q$2+1)","v":""},null,{"$f":"IF(AND($O389=1,OR($L$1=$D389,$L$2=$D389)),A389,\"\")","v":""},{"$f":"IF(AND($O389=1,OR($L$1=$D389,$L$2=$D389)),B389,\"\")","v":""},{"$f":"IF(AND($O389=1,OR($L$1=$D389,$L$2=$D389)),C389,\"\")","v":""},{"$f":"IF(AND($O389=1,OR($L$1=$D389,$L$2=$D389)),D389,\"\")","v":""},{"$f":"IF(AND($O389=1,OR($L$1=$D389,$L$2=$D389)),E389,\"\")","v":""},{"$f":"IF(AND($O389=1,OR($L$1=$D389,$L$2=$D389)),F389,\"\")","v":""},null,385,"","","","","",""]
[14914,"GONZALEZ Mar","JUV-1","S.CUGA","F",1016.0999999999999,null,null,null,null,null,null,null,{"$f":"VLOOKUP(C390,$K$60:$L$70,2,0)","v":5},{"$f":"IF($L$3=\"\",1,IF($L$3=0,IF(E390=\"F\",1,0),IF(N390<=$L$3,1,0)))","v":1},null,"","",null,"","","","","","",null,{"$f":"AA389+1","v":386},{"$f":"IF(AND($L$1=\"\",$L$2=\"\"),\"\",IF($AA390>$Q$3-$Q$2+1,\"\",VLOOKUP($AA390,$R$5:$Y$600,AB$3,0)))","v":""},{"$f":"IF(AND($L$1=\"\",$L$2=\"\"),\"\",IF($AA390>$Q$3-$Q$2+1,\"\",VLOOKUP($AA390,$R$5:$Y$600,AC$3,0)))","v":""},"","","",""]
[13993,"PRIETO Arnau","INF-2","S.CUGA","M",8113.51,null,null,null,null,null,null,null,4,1,null,"","",null,"","","","","","",null,387,"","","","","",""]
[15071,"LLOVET Agnès","BEN-2","CNSABA","F",439.43,null,null,null,null,null,null,null,2,1,null,"","",null,"","","","","","",null,388,"","","","","",""]
[12682,"CARRO Sofia","ALE-2","INDEPE","F",5983.63,null,null,null,null,null,null,null,3,1,null,"","",null,"","","","","","",null,389,"","","","","",""]
[13758,"CALLEJON Christian","INF-1","S.CUGA","M",7144.93,null,null,null,null,null,null,null,4,1,null,"","",null,"","","","","","",null,390,"","","","","",""]
[15413,"JANSOONE Matias","INF-1","S.CUGA","M",143.68,null,null,null,null,null,null,null,4,1,null,"","",null,"","","","","","",null,391,"","","","","",""]
[13765,"ARAUJO Ismael","INF-3","S.CUGA","M",5122.92,null,null,null,null,null,null,null,4,1,null,"","",null,"","","","","","",null,392,"","","","","",""]
[11381,"AMAGO Carla","INF-3","S.CUGA","F",2739.93,null,null,null,null,null,null,null,4,1,null,"","",null,"","","","","","",null,393,"","","","","",""]
[14325,"AGULLÓ Gerard","INF-2","S.CUGA","M",2225.84,null,null,null,null,null,null,null,4,1,null,"","",null,"","","","","","",null,394,"","","","","",""]
[16750,"BOTTO Samuel","ALE-2","S.CUGA","M",23.9,null,null,null,null,null,null,null,3,1,null,"","",null,"","","","","","",null,395,"","","","","",""]
[12724,"ESTIVILL Cristina","INF-1","S.CUGA","F",3951.95,null,null,null,null,null,null,null,4,1,null,"","",null,"","","","","","",null,396,"",{"$f":"IF(AND($L$1=\"\",$L$2=\"\"),\"\",IF($AA400>$Q$3-$Q$2+1,\"\",VLOOKUP($AA400,$R$5:$Y$600,AC$3,0)))","v":""},"","","",""]
[15644,"SORIANO Martí","INF-2","S.CUGA","M",469.89,null,null,null,null,null,null,null,4,1,null,"","",null,"","","","","","",null,397,"","","","","",""]
[13558,"MEDEL Èric","INF-1","S.CUGA","M",130.43,null,null,null,null,null,null,null,4,1,null,"","",null,"","","","","","",null,398,"","","","","",""]
[15540,"HOGARD Edgar","INF-3","S.CUGA","M",190.82999999999998,null,null,null,null,null,null,null,4,1,null,"","",null,"","","","","","",null,399,"","","","","",""]
[16752,"ZAYUELAS Pol","INF-2","S.CUGA","M",153.64999999999998,null,null,null,null,null,null,null,4,1,null,"","",null,"","","","","","",null,400,"","","","","",""]
[15416,"MARTÍNEZ Matteo","INF-2","S.CUGA","M",52.84,null,null,null,null,null,null,null,4,1,null,"","",null,"","","","","","",null,401,"","","","","",""]
[15778,"SÉNDER Gerard","ALE-1","S.CUGA","M",426.1,null,null,null,null,null,null,null,3,1,null,"","",null,"","","","","","",null,402,"","","","","",""]
[14754,"BENAVIDES Taiel","BEN-2","S.CUGA","M",86.42,null,null,null,null,null,null,null,2,1,null,"","",null,"","","","","","",null,403,"","","","","",""]
[15445,"OJZORNIJS George","ALE-1","S.CUGA","M",245.60999999999999,null,null,null,null,null,null,null,3,1,null,"","",null,"","","","","","",null,404,"","","","","",""]
[15485,"LOBERA Jordi","ALE-1","S.CUGA","M",493.38,null,null,null,null,null,null,null,3,1,null,"","",null,"","","","","","",null,405,"","","","","",""]
[16833,"PALMER Jan","BEN-2","S.CUGA","M",7.82,null,null,null,null,null,null,null,2,1,null,"","",null,"","","","","","",null,406,"",{"$f":"IF(AND($L$1=\"\",$L$2=\"\"),\"\",IF($AA410>$Q$3-$Q$2+1,\"\",VLOOKUP($AA410,$R$5:$Y$600,AC$3,0)))","v":""},"","","",""]
[16832,"ZÁRATE Pablo","ALE-1","S.CUGA","M",26.379999999999995,null,null,null,null,null,null,null,3,1,null,"","",null,"","","","","","",null,407,"","","","","",""]
[15484,"LLOVERAS Adrià","BEN-2","S.CUGA","M",188.62,null,null,null,null,null,null,null,2,1,null,"","",null,"","","","","","",null,408,"","","","","",""]
[16829,"SÁNCHEZ Álvaro","ALE-1","S.CUGA","M",1.67,null,null,null,null,null,null,null,3,1,null,"","",null,"","","","","","",null,409,"","","","","",""]
[16831,"SÁNCHEZ Javier","PRE-0","S.CUGA","M",0.75,null,null,null,null,null,null,null,1,1,null,"","",null,"","","","","","",null,410,"","","","","",""]
[16826,"SOLE Eliot","PRE-0","S.CUGA","M",4.76,null,null,null,null,null,null,null,1,1,null,"","",null,"","","","","","",null,411,"","","","","",""]
[16827,"SOLÉ Théo","BEN-2","S.CUGA","M",6.16,null,null,null,null,null,null,null,2,1,null,"","",null,"","","","","","",null,412,"","","","","",""]
[16828,"JAUME Toni","ALE-1","S.CUGA","M",21.07,null,null,null,null,null,null,null,3,1,null,"","",null,"","","","","","",null,413,"","","","","",""]
[16824,"TORRENT Adrià","ALE-1","S.CUGA","M",106.5,null,null,null,null,null,null,null,3,1,null,"","",null,"","","","","","",null,414,"","","","","",""]
[15486,"BATLLE Clara Yihuan","BEN-1","S.CUGA","F",2.33,null,null,null,null,null,null,null,2,1,null,"","",null,"","","","","","",null,415,"","","","","",""]
[13709,"PONCE Lucas","BEN-2","FALCO","M",268.7,null,null,null,null,null,null,null,2,1,null,"","",null,"","","","","","",null,416,"",{"$f":"IF(AND($L$1=\"\",$L$2=\"\"),\"\",IF($AA420>$Q$3-$Q$2+1,\"\",VLOOKUP($AA420,$R$5:$Y$600,AC$3,0)))","v":""},"","","",""]
[14707,"CAINELLI Luca","ALE-1","FALCO","M",284.15000000000003,null,null,null,null,null,null,null,3,1,null,"","",null,"","","","","","",null,417,"","","","","",""]
[15199,"AIONESEI Arnau Andrei","ALE-1","FALCO","M",250.29000000000002,null,null,null,null,null,null,null,3,1,null,"","",null,"","","","","","",null,418,"","","","","",""]
[15935,"MOLINA Eothain","JUV-1","FALCO","M",141.59,null,null,null,null,null,null,null,5,1,null,"","",null,"","","","","","",null,419,"","","","","",""]
[14384,"CAYELLAS Carla","BEN-1","FALCO","F",65.19,null,null,null,null,null,null,null,2,1,null,"","",null,"","","","","","",null,420,"","","","","",""]
[16666,"CASANELLAS Arnau","BEN-2","FALCO","M",8.31,null,null,null,null,null,null,null,2,1,null,"","",null,"","","","","","",null,421,"","","","","",""]
[16136,"PAGES Arnau","BEN-2","FALCO","M",5.51,null,null,null,null,null,null,null,2,1,null,"","",null,"","","","","","",null,422,"","","","","",""]
[14307,"TRALLERO Ona","BEN-1","FALCO","F",153.12,null,null,null,null,null,null,null,2,1,null,"","",null,"","","","","","",null,423,"","","","","",""]
[14738,"CAPILLAS Laia","BEN-2","FALCO","F",132.05000000000001,null,null,null,null,null,null,null,2,1,null,"","",null,"","","","","","",null,424,"","","","","",""]
[16664,"SOLER Marcel","BEN-2","FALCO","M",8.24,null,null,null,null,null,null,null,2,1,null,"","",null,"","","","","","",null,425,"","","","","",""]
[13455,"VILASECA Roc","JUV-1","FALCO","M",6878.5,null,null,null,null,null,null,null,5,1,null,"","",null,"","","","","","",null,426,"",{"$f":"IF(AND($L$1=\"\",$L$2=\"\"),\"\",IF($AA430>$Q$3-$Q$2+1,\"\",VLOOKUP($AA430,$R$5:$Y$600,AC$3,0)))","v":""},"","","",""]
[13072,"LIMACHE Elias","JUV-2","FALCO","M",964.27,null,null,null,null,null,null,null,5,1,null,"","",null,"","","","","","",null,427,"","","","","",""]
[12469,"TORREZ Sean Marc","JUV-2","FALCO","M",2349.54,null,null,null,null,null,null,null,5,1,null,"","",null,"","","","","","",null,428,"","","","","",""]
[7931,"TORAL Alex","JUV-3","SENTME","M",5212.83,null,null,null,null,null,null,null,5,1,null,"","",null,"","","","","","",null,429,"","","","","",""]
[14622,"MANY Marti","JUV-3","SENTME","M",862.77,null,null,null,null,null,null,null,5,1,null,"","",null,"","","","","","",null,430,"","","","","",""]
[16724,"MESA Alexandre","ALE-2","SENTME","M",15.129999999999999,null,null,null,null,null,null,null,3,1,null,"","",null,"","","","","","",null,431,"","","","","",""]
[16843,"ALONSO Marina","INF-2","PREMIA","F",27.010000000000005,null,null,null,null,null,null,null,4,1,null,"","",null,"","","","","","",null,432,"","","","","",""]
[16844,"LÓPEZ Raúl","INF-3","PREMIA","M",99.63,null,null,null,null,null,null,null,4,1,null,"","",null,"","","","","","",null,433,"","","","","",""]
[16845,"OBRADÓ Pol","INF-2","PREMIA","M",66.02000000000001,null,null,null,null,null,null,null,4,1,null,"","",null,"","","","","","",null,434,"","","","","",""]
[16846,"GILABERT Bruna","INF-3","PREMIA","F",59.679999999999993,null,null,null,null,null,null,null,4,1,null,"","",null,"","","","","","",null,435,"","","","","",""]
[16847,"SEVILLANO Simón","ALE-2","PREMIA","M",11.09,null,null,null,null,null,null,null,3,1,null,"","",null,"","","","","","",null,436,"",{"$f":"IF(AND($L$1=\"\",$L$2=\"\"),\"\",IF($AA440>$Q$3-$Q$2+1,\"\",VLOOKUP($AA440,$R$5:$Y$600,AC$3,0)))","v":""},"","","",""]
[12467,"BATET Pol","JUV-1","LLUÏSO","M",4626.29,null,null,null,null,null,null,null,5,1,null,"","",null,"","","","","","",null,437,"","","","","",""]
[11867,"BOUCHERIE Enoc","INF-1","AMICS","M",2314.75,null,null,null,null,null,null,null,4,1,null,"","",null,"","","","","","",null,438,"","","","","",""]
[11561,"PAGÈS Anna","ALE-2","AMICS","F",2622.06,null,null,null,null,null,null,null,3,1,null,"","",null,"","","","","","",null,439,"","","","","",""]
[16913,"ESCOTE Pau","ALE-1","S.CELO","M",14.08,null,null,null,null,null,null,null,3,1,null,"","",null,"","","","","","",null,440,"","","","","",""]
[16881,"CAO Marti","ALE-1","S.CELO","M",52.36,null,null,null,null,null,null,null,3,1,null,"","",null,"","","","","","",null,441,"","","","","",""]
[15100,"ALONSO Eric","ALE-1","ELS 8","M",23.9,null,null,null,null,null,null,null,3,1,null,"","",null,"","","","","","",null,442,"","","","","",""]
[15149,"GARCIA Quim","ALE-1","ELS 8","M",11.43,null,null,null,null,null,null,null,3,1,null,"","",null,"","","","","","",null,443,"","","","","",""]
[14714,"GURI Marc","ALE-2","ELS 8","M",56.83,null,null,null,null,null,null,null,3,1,null,"","",null,"","","","","","",null,444,"","","","","",""]
[13810,"MANZULLI Ainara","ALE-2","ELS 8","F",492.75999999999993,null,null,null,null,null,null,null,3,1,null,"","",null,"","","","","","",null,445,"","","","","",""]
[14251,"SENYAL Bernat","ALE-2","ELS 8","M",284.03000000000003,null,null,null,null,null,null,null,3,1,null,"","",null,"","","","","","",null,446,"",{"$f":"IF(AND($L$1=\"\",$L$2=\"\"),\"\",IF($AA450>$Q$3-$Q$2+1,\"\",VLOOKUP($AA450,$R$5:$Y$600,AC$3,0)))","v":""},"","","",""]
[15929,"BALLÚS Gerard","INF-1","ELS 8","M",287.02,null,null,null,null,null,null,null,4,1,null,"","",null,"","","","","","",null,447,"","","","","",""]
[10672,"CASTELLS Iris","INF-2","ELS 8","F",6722.62,null,null,null,null,null,null,null,4,1,null,"","",null,"","","","","","",null,448,"","","","","",""]
[11863,"MONTAGUT Joan","INF-2","ELS 8","M",4951.99,null,null,null,null,null,null,null,4,1,null,{"$f":"IF(U453=\"\",\"\",COUNTIF($U$5:$U$600,\"<=\"&$U453))","v":""},{"$f":"IF(Q453=\"\",\"\",Q453-$Q$2+1)","v":""},null,{"$f":"IF(AND($O453=1,OR($L$1=$D453,$L$2=$D453)),A453,\"\")","v":""},{"$f":"IF(AND($O453=1,OR($L$1=$D453,$L$2=$D453)),B453,\"\")","v":""},{"$f":"IF(AND($O453=1,OR($L$1=$D453,$L$2=$D453)),C453,\"\")","v":""},{"$f":"IF(AND($O453=1,OR($L$1=$D453,$L$2=$D453)),D453,\"\")","v":""},{"$f":"IF(AND($O453=1,OR($L$1=$D453,$L$2=$D453)),E453,\"\")","v":""},{"$f":"IF(AND($O453=1,OR($L$1=$D453,$L$2=$D453)),F453,\"\")","v":""},null,449,"","","","","",""]
[12296,"COROMINAS Albert","INF-2","ELS 8","M",5282.9,null,null,null,null,null,null,null,{"$f":"VLOOKUP(C454,$K$60:$L$70,2,0)","v":4},{"$f":"IF($L$3=\"\",1,IF($L$3=0,IF(E454=\"F\",1,0),IF(N454<=$L$3,1,0)))","v":1},null,"","",null,"","","","","","",null,{"$f":"AA453+1","v":450},{"$f":"IF(AND($L$1=\"\",$L$2=\"\"),\"\",IF($AA454>$Q$3-$Q$2+1,\"\",VLOOKUP($AA454,$R$5:$Y$600,AB$3,0)))","v":""},"","","","",""]
[12768,"BENHARI Ayoub","JUV-1","TORELL","M",1197.3,null,null,null,null,null,null,null,5,1,null,"","",null,"","","","","","",null,451,"","","","","",""]
[12767,"BENHARI Mohamed","JUV-2","TORELL","M",4082.15,null,null,null,null,null,null,null,5,1,null,"","",null,"","","","","","",null,452,"","","","","",""]
[14387,"RECHE Alex","INF-2","CNSABA","M",586.25,null,null,null,null,null,null,null,4,1,null,"","",null,"","","","","","",null,453,"","","","","",""]
[12136,"PLAZA Pau","INF-3","CNSABA","M",2262.98,null,null,null,null,null,null,null,4,1,null,"","",null,"","","","","","",null,454,"","","","","",""]
[7752,"FONT Aniol","INF-1","CNSABA","M",12073.24,null,null,null,null,null,null,null,4,1,null,"","",null,"","","","","","",null,455,"","","","","",""]
[15899,"SALA Jordi","INF-3","CNSABA","M",1957.03,null,null,null,null,null,null,null,4,1,null,"","",null,"","","","","","",null,456,"",{"$f":"IF(AND($L$1=\"\",$L$2=\"\"),\"\",IF($AA460>$Q$3-$Q$2+1,\"\",VLOOKUP($AA460,$R$5:$Y$600,AC$3,0)))","v":""},"","","",""]
[12432,"VEGA Alex","JUV-2","CNSABA","M",4087.6699999999996,null,null,null,null,null,null,null,5,1,null,"","",null,"","","","","","",null,457,"","","","","",""]
[16852,"HUGUET Thiago","PRE-0","CNSABA","M",7.11,null,null,null,null,null,null,null,1,1,null,"","",null,"","","","","","",null,458,"","","","","",""]
[15554,"ALCARAZ Eloi","ALE-2","CNSABA","M",214.65,null,null,null,null,null,null,null,3,1,null,"","",null,"","","","","","",null,459,"","","","","",""]
[12785,"AGUILERA Marta","INF-2","CNSABA","F",1480.4700000000003,null,null,null,null,null,null,null,4,1,null,"","",null,"","","","","","",null,460,"","","","","",""]
[13382,"AGUILERA Alejandro","BEN-2","CNSABA","M",401.05000000000007,null,null,null,null,null,null,null,2,1,null,"","",null,"","","","","","",null,461,"","","","","",""]
[16851,"LAZARO Marc","INF-1","CNSABA","M",75.61999999999999,null,null,null,null,null,null,null,4,1,null,"","",null,"","","","","","",null,462,"","","","","",""]
[11643,"BARBERÀ Quim","ALE-1","CNSABA","M",1989.33,null,null,null,null,null,null,null,3,1,null,"","",null,"","","","","","",null,463,"","","","","",""]
[13520,"VILA Josep","BEN-2","CNSABA","M",375.56999999999994,null,null,null,null,null,null,null,2,1,null,"","",null,"","","","","","",null,464,"","","","","",""]
[16321,"PARRA Juan David","JUV-3","CNSABA","M",348.90999999999997,null,null,null,null,null,null,null,5,1,null,"","",null,"","","","","","",null,465,"","","","","",""]
[14358,"SILVESTRE Alex","ALE-2","CNSABA","M",2280.9499999999998,null,null,null,null,null,null,null,3,1,null,"","",null,"","","","","","",null,466,"",{"$f":"IF(AND($L$1=\"\",$L$2=\"\"),\"\",IF($AA470>$Q$3-$Q$2+1,\"\",VLOOKUP($AA470,$R$5:$Y$600,AC$3,0)))","v":""},"","","",""]
[14734,"DALMAU Lluc","BEN-2","VICTT","M",0.17,null,null,null,null,null,null,null,2,1,null,"","",null,"","","","","","",null,467,"","","","","",""]
[15852,"CABALLÉ Joan","ALE-2","VICTT","M",2.42,null,null,null,null,null,null,null,3,1,null,"","",null,"","","","","","",null,468,"","","","","",""]
[15615,"BRANDARIZ Victor","INF-1","OLESA","M",170.53,null,null,null,null,null,null,null,4,1,null,"","",null,"","","","","","",null,469,"","","","","",""]
[15472,"LLOYD Albert","ALE-1","HOSPIT","M",6.09,null,null,null,null,null,null,null,3,1,null,"","",null,"","","","","","",null,470,"","","","","",""]
[14018,"DANTAS Gabriel","INF-2","HOSPIT","M",72.2,null,null,null,null,null,null,null,4,1,null,"","",null,"","","","","","",null,471,"","","","","",""]
[16203,"ANGULO Diego","BEN-1","HOSPIT","M",6.99,null,null,null,null,null,null,null,2,1,null,"","",null,"","","","","","",null,472,"","","","","",""]
[16756,"RUBIO Gerard","INF-2","HOSPIT","M",37.880000000000003,null,null,null,null,null,null,null,4,1,null,"","",null,"","","","","","",null,473,"","","","","",""]
[15581,"IBARRA Joel","INF-2","HOSPIT","M",81.16,null,null,null,null,null,null,null,4,1,null,"","",null,"","","","","","",null,474,"","","","","",""]
[15582,"IBARRA Oliver","ALE-2","HOSPIT","M",57.330000000000005,null,null,null,null,null,null,null,3,1,null,"","",null,"","","","","","",null,475,"","","","","",""]
[14949,"GALOFRÉ Guillem","INF-1","VILAFR","M",129.92000000000002,null,null,null,null,null,null,null,4,1,null,"","",null,"","","","","","",null,476,"",{"$f":"IF(AND($L$1=\"\",$L$2=\"\"),\"\",IF($AA480>$Q$3-$Q$2+1,\"\",VLOOKUP($AA480,$R$5:$Y$600,AC$3,0)))","v":""},"","","",""]
[16849,"SANCHEZ Angel","ALE-1","VILAFR","M",13.69,null,null,null,null,null,null,null,3,1,null,"","",null,"","","","","","",null,477,"","","","","",""]
[15749,"BARBARA Enrique","ALE-2","CTTBCN","M",49.26,null,null,null,null,null,null,null,3,1,null,"","",null,"","","","","","",null,478,"","","","","",""]
[16909,"BUITRAGO David","ALE-2","SVHORT","M",16.240000000000002,null,null,null,null,null,null,null,3,1,null,"","",null,"","","","","","",null,479,"","","","","",""]
[16908,"RIVAS Raul","INF-2","SVHORT","M",26.259999999999998,null,null,null,null,null,null,null,4,1,null,"","",null,"","","","","","",null,480,"","","","","",""]
[16888,"NOYA Bernat","INF-1","SVHORT","M",9.15,null,null,null,null,null,null,null,4,1,null,"","",null,"","","","","","",null,481,"","","","","",""]
[16907,"LOPEZ Adam","ALE-2","SVHORT","M",7.2,null,null,null,null,null,null,null,3,1,null,"","",null,"","","","","","",null,482,"","","","","",""]
[15579,"DÍAZ Héctor","ALE-2","SVHORT","M",24.9,null,null,null,null,null,null,null,3,1,null,"","",null,"","","","","","",null,483,"","","","","",""]
[16961,"CABANES Edurne","INF-1","INDEPE","F",9.4799999999999986,null,null,null,null,null,null,null,4,1,null,"","",null,"","","","","","",null,484,"","","","","",""]
[16959,"CANET Zenon","INF-2","INDEPE","M",7.34,null,null,null,null,null,null,null,4,1,null,"","",null,"","","","","","",null,485,"","","","","",""]
[16958,"CAPPI Xavier","ALE-2","INDEPE","M",31.689999999999998,null,null,null,null,null,null,null,3,1,null,"","",null,"","","","","","",null,486,"",{"$f":"IF(AND($L$1=\"\",$L$2=\"\"),\"\",IF($AA490>$Q$3-$Q$2+1,\"\",VLOOKUP($AA490,$R$5:$Y$600,AC$3,0)))","v":""},"","","",""]
[16956,"NOTARI Caio","JUV-2","INDEPE","M",49.55,null,null,null,null,null,null,null,5,1,null,"","",null,"","","","","","",null,487,"","","","","",""]
[16957,"SANS Joel","JUV-2","INDEPE","M",40.75,null,null,null,null,null,null,null,5,1,null,"","",null,"","","","","","",null,488,"","","","","",""]
[16960,"SANS Joan","INF-3","INDEPE","M",8.9899999999999984,null,null,null,null,null,null,null,4,1,null,"","",null,"","","","","","",null,489,"","","","","",""]
[17011,"KMENT Isaac","ALE-2","AMICS","M",12.67,null,null,null,null,null,null,null,3,1,null,"","",null,"","","","","","",null,490,"","","","","",""]
[17012,"FORNIELES Xavier","ALE-1","AMICS","M",1.44,null,null,null,null,null,null,null,3,1,null,"","",null,"","","","","","",null,491,"","","","","",""]
[16671,"ROSSLER Blake","BEN-2","BADALO","M",5.6099999999999994,null,null,null,null,null,null,null,2,1,null,"","",null,"","","","","","",null,492,"","","","","",""]
[15789,"KARANDIKAR Carlos Anand","INF-2","S.CUGA","M",13,null,null,null,null,null,null,null,4,1,null,"","",null,"","","","","","",null,493,"","","","","",""]
[16715,"BOIX Roc","INF-3","CARDED","M",21.38,null,null,null,null,null,null,null,4,1,null,"","",null,"","","","","","",null,494,"","","","","",""]
[16865,"D'ANGELO Pau","BEN-1","FALCO","M",5.44,null,null,null,null,null,null,null,2,1,null,"","",null,"","","","","","",null,495,"","","","","",""]
[14843,"EL BOUTI Janna","INF-1","SANTS","F",4.7699999999999996,null,null,null,null,null,null,null,4,1,null,"","",null,"","","","","","",null,496,"",{"$f":"IF(AND($L$1=\"\",$L$2=\"\"),\"\",IF($AA500>$Q$3-$Q$2+1,\"\",VLOOKUP($AA500,$R$5:$Y$600,AC$3,0)))","v":""},"","","",""]
[17031,"REÑE Adria","JUV-2","SANTS","M",0,null,null,null,null,null,null,null,5,1,null,"","",null,"","","","","","",null,497,"","","","","",""]
[15337,"BERNABEU Aleix","INF-1","GRANO","M",7.07,null,null,null,null,null,null,null,4,1,null,"","",null,"","","","","","",null,498,"","","","","",""]
[11209,"VELEZ Alex","INF-1","ATEN82","M",20.67,null,null,null,null,null,null,null,4,1,null,"","",null,"","","","","","",null,499,"","","","","",""]
[16049,"NAVAL Nico","ALE-2","CASTDF","M",10.91,null,null,null,null,null,null,null,3,1,null,"","",null,"","","","","","",null,500,"","","","","",""]
[16440,"GARCÍA Adrian","ALE-2","CASTDF","M",51.52,null,null,null,null,null,null,null,3,1,null,"","",null,"","","","","","",null,501,"","","","","",""]
[16285,"BUMGARDNER Jacob","ALE-1","CASTDF","M",16.920000000000002,null,null,null,null,null,null,null,3,1,null,"","",null,"","","","","","",null,502,"","","","","",""]
[15759,"PUÑAL Nicolas","ALE-2","INDEPE","M",37.15,null,null,null,null,null,null,null,3,1,null,"","",null,"","","","","","",null,503,"","","","","",""]
[14177,"FUENTES Josep","INF-1","MATARO","M",6.62,null,null,null,null,null,null,null,4,1,null,"","",null,"","","","","","",null,504,"","","","","",""]
[17052,"VIVAR Ezequiel","INF-1","HOSPIT","M",8.59,null,null,null,null,null,null,null,4,1,null,"","",null,"","","","","","",null,505,"","","","","",""]
[17047,"PASQUINI Nagual","BEN-2","VILANO","M",16.53,null,null,null,null,null,null,null,2,1,null,"","",null,"","","","","","",null,506,"",{"$f":"IF(AND($L$1=\"\",$L$2=\"\"),\"\",IF($AA510>$Q$3-$Q$2+1,\"\",VLOOKUP($AA510,$R$5:$Y$600,AC$3,0)))","v":""},"","","",""]
[17043,"FONT Miles","ALE-1","INDEPE","M",4.4800000000000004,null,null,null,null,null,null,null,3,1,null,"","",null,"","","","","","",null,507,"","","","","",""]
[15444,"ABELLA Roger","INF-2","PREMIA","M",3.7800000000000002,null,null,null,null,null,null,null,4,1,null,"","",null,"","","","","","",null,508,"","","","","",""]
[16347,"VAZQUEZ Alan","INF-2","VILANO","M",15.439999999999998,null,null,null,null,null,null,null,4,1,null,"","",null,"","","","","","",null,509,"","","","","",""]
[16503,"ISERN Yago","ALE-1","ELS 8","M",8.129999999999999,null,null,null,null,null,null,null,3,1,null,"","",null,"","","","","","",null,510,"","","","","",""]
[16505,"SOLDEVILA Pere","PRE-0","ELS 8","M",5.04,null,null,null,null,null,null,null,1,1,null,"","",null,"","","","","","",null,511,"","","","","",""]
[16506,"SOLDEVILA Jan","ALE-2","ELS 8","M",4.22,null,null,null,null,null,null,null,3,1,null,"","",null,"","","","","","",null,512,"","","","","",""]
[17077,"MARTINEZ Juan Esteban","ALE-2","INDEPE","M",4.25,null,null,null,null,null,null,null,3,1,null,{"$f":"IF(U517=\"\",\"\",COUNTIF($U$5:$U$600,\"<=\"&$U517))","v":""},{"$f":"IF(Q517=\"\",\"\",Q517-$Q$2+1)","v":""},null,{"$f":"IF(AND($O517=1,OR($L$1=$D517,$L$2=$D517)),A517,\"\")","v":""},{"$f":"IF(AND($O517=1,OR($L$1=$D517,$L$2=$D517)),B517,\"\")","v":""},{"$f":"IF(AND($O517=1,OR($L$1=$D517,$L$2=$D517)),C517,\"\")","v":""},{"$f":"IF(AND($O517=1,OR($L$1=$D517,$L$2=$D517)),D517,\"\")","v":""},{"$f":"IF(AND($O517=1,OR($L$1=$D517,$L$2=$D517)),E517,\"\")","v":""},{"$f":"IF(AND($O517=1,OR($L$1=$D517,$L$2=$D517)),F517,\"\")","v":""},null,513,"","","","","",""]
[17112,"RODRIGUEZ Ismael","INF-1","VILANO","M",10.34,null,null,null,null,null,null,null,{"$f":"VLOOKUP(C518,$K$60:$L$70,2,0)","v":4},{"$f":"IF($L$3=\"\",1,IF($L$3=0,IF(E518=\"F\",1,0),IF(N518<=$L$3,1,0)))","v":1},null,"","",null,"","","","","","",null,{"$f":"AA517+1","v":514},{"$f":"IF(AND($L$1=\"\",$L$2=\"\"),\"\",IF($AA518>$Q$3-$Q$2+1,\"\",VLOOKUP($AA518,$R$5:$Y$600,AB$3,0)))","v":""},"","","","",""]
[17050,"ALVAREZ Albert","ALE-2","INDEPE","M",0,null,null,null,null,null,null,null,3,1,null,"","",null,"","","","","","",null,515,"","","","","",""]
[17051,"GARCIA Pablo","INF-3","INDEPE","M",20.09,null,null,null,null,null,null,null,4,1,null,"","",null,"","","","","","",null,516,"",{"$f":"IF(AND($L$1=\"\",$L$2=\"\"),\"\",IF($AA520>$Q$3-$Q$2+1,\"\",VLOOKUP($AA520,$R$5:$Y$600,AC$3,0)))","v":""},"","","",""]
[17108,"MAGEM Pau","ALE-1","CTGALI","M",0.83,null,null,null,null,null,null,null,3,1,null,"","",null,"","","","","","",null,517,"","","","","",""]
[17128,"AGUIRRE Biel","ALE-2","AMICS","M",13.9,null,null,null,null,null,null,null,3,1,null,"","",null,"","","","","","",null,518,"","","","","",""]
[17127,"IGLESIAS Izan","BEN-2","VILASS","M",5.6,null,null,null,null,null,null,null,2,1,null,"","",null,"","","","","","",null,519,"","","","","",""]
[11716,"OBUKHOV Fedor","INF-3","ESPARR","M",2264.2700000000004,null,null,null,null,null,null,null,4,1,null,"","",null,"","","","","","",null,520,"","","","","",""]
[17137,"CANOVAS Joan","BEN-2","S.ANDR","M",5.46,null,null,null,null,null,null,null,2,1,null,"","",null,"","","","","","",null,521,"","","","","",""]
[17138,"VAZQUEZ Gerard","ALE-2","VILASS","M",5.68,null,null,null,null,null,null,null,3,1,null,"","",null,"","","","","","",null,522,"","","","","",""]
[15904,"GRAU Jan","INF-1","CTLLAR","M",3.78,null,null,null,null,null,null,null,4,1,null,"","",null,"","","","","","",null,523,"","","","","",""]
[15910,"IGLESIAS Nil","BEN-1","CTLLAR","M",7.4,null,null,null,null,null,null,null,2,1,null,"","",null,"","","","","","",null,524,"","","","","",""]
[17142,"CRUZADO Nicolás","INF-1","CTLLAR","M",3.06,null,null,null,null,null,null,null,4,1,null,"","",null,"","","","","","",null,525,"","","","","",""]
[15900,"RAMÍREZ Leo","ALE-1","CTLLAR","M",2.81,null,null,null,null,null,null,null,3,1,null,"","",null,"","","","","","",null,526,"",{"$f":"IF(AND($L$1=\"\",$L$2=\"\"),\"\",IF($AA530>$Q$3-$Q$2+1,\"\",VLOOKUP($AA530,$R$5:$Y$600,AC$3,0)))","v":""},"","","",""]
[15902,"GARCIA Jordi","ALE-1","CTLLAR","M",4.34,null,null,null,null,null,null,null,3,1,null,"","",null,"","","","","","",null,527,"","","","","",""]
[15979,"GARCIA Biel","INF-2","CTLLAR","M",5.49,null,null,null,null,null,null,null,4,1,null,"","",null,"","","","","","",null,528,"","","","","",""]
[17141,"ROMERO Pau","ALE-1","CTLLAR","M",3.8000000000000003,null,null,null,null,null,null,null,3,1,null,"","",null,"","","","","","",null,529,"","","","","",""]
[17140,"CIRERA Marcel","INF-2","CTLLAR","M",6.13,null,null,null,null,null,null,null,4,1,null,"","",null,"","","","","","",null,530,"","","","","",""]
[17065,"GALÁN Marc","ALE-1","CTLLAR","M",0.75,null,null,null,null,null,null,null,3,1,null,"","",null,"","","","","","",null,531,"","","","","",""]
[17064,"ROMEU Aran","ALE-2","CTLLAR","M",5.07,null,null,null,null,null,null,null,3,1,null,"","",null,"","","","","","",null,532,"","","","","",""]
[17063,"BARNES Oliver","ALE-2","CTLLAR","M",4.28,null,null,null,null,null,null,null,3,1,null,"","",null,"","","","","","",null,533,"","","","","",""]
[17062,"LLORET Aleix","ALE-1","CTLLAR","M",4.9000000000000004,null,null,null,null,null,null,null,3,1,null,"","",null,"","","","","","",null,534,"","","","","",""]
[15191,"MAÑALICH Gerard","ALE-1","ATEN82","M",8.65,null,null,null,null,null,null,null,3,1,null,"","",null,"","","","","","",null,535,"","","","","",""]
[15988,"MAÑALICH Jordi","ALE-1","ATEN82","M",5.32,null,null,null,null,null,null,null,3,1,null,"","",null,"","","","","","",null,536,"",{"$f":"IF(AND($L$1=\"\",$L$2=\"\"),\"\",IF($AA540>$Q$3-$Q$2+1,\"\",VLOOKUP($AA540,$R$5:$Y$600,AC$3,0)))","v":""},"","","",""]
[15293,"PICÓ Carlos","INF-1","ATEN82","M",8.74,null,null,null,null,null,null,null,4,1,null,"","",null,"","","","","","",null,537,"","","","","",""]
[15146,"ROCA Marc","ALE-1","INDEPE","M",20.92,null,null,null,null,null,null,null,3,1,null,"","",null,"","","","","","",null,538,"","","","","",""]
[15666,"JIMENEZ Roger","ALE-1","PALES","M",5.76,null,null,null,null,null,null,null,3,1,null,"","",null,"","","","","","",null,539,"","","","","",""]
[14436,"GORINA Miquel","JUV-1","PALES","M",16.259999999999998,null,null,null,null,null,null,null,5,1,null,"","",null,"","","","","","",null,540,"","","","","",""]
[15660,"YAÑEZ Biel","JUV-2","PALES","M",4.17,null,null,null,null,null,null,null,5,1,null,"","",null,"","","","","","",null,541,"","","","","",""]
[15661,"MASIP Aria","BEN-2","PALES","M",8.6900000000000013,null,null,null,null,null,null,null,2,1,null,"","",null,"","","","","","",null,542,"","","","","",""]
[15668,"COOGAN Emma","INF-1","PALES","F",10.6,null,null,null,null,null,null,null,4,1,null,"","",null,"","","","","","",null,543,"","","","","",""]
[15667,"ESCAMILLA Marti","INF-1","PALES","M",11.07,null,null,null,null,null,null,null,4,1,null,"","",null,"","","","","","",null,544,"","","","","",""]
[12779,"VAZQUEZ Rodrigo","INF-3","PALES","M",0.83,null,null,null,null,null,null,null,4,1,null,"","",null,"","","","","","",null,545,"","","","","",""]
[17144,"HAWKES Ted","INF-1","VILANO","M",2.92,null,null,null,null,null,null,null,4,1,null,"","",null,"","","","","","",null,546,"",{"$f":"IF(AND($L$1=\"\",$L$2=\"\"),\"\",IF($AA550>$Q$3-$Q$2+1,\"\",VLOOKUP($AA550,$R$5:$Y$600,AC$3,0)))","v":""},"","","",""]
[17162,"RUIZ Unai","INF-1","HOSPIT","M",22.38,null,null,null,null,null,null,null,4,1,null,"","",null,"","","","","","",null,547,"","","","","",""]
[17163,"RUIZ Izan","ALE-1","HOSPIT","M",13.59,null,null,null,null,null,null,null,3,1,null,"","",null,"","","","","","",null,548,"","","","","",""]
[11864,"RODRIGUEZ Mireia","BEN-2","PARETS","F",2.59,null,null,null,null,null,null,null,2,1,null,"","",null,"","","","","","",null,549,"","","","","",""]
[17185,"ZWARTJES Leon","INF-1","CTLLAR","M",2.5,null,null,null,null,null,null,null,4,1,null,"","",null,"","","","","","",null,550,"","","","","",""]
[17207,"ALBA Francesc Marc","INF-3","AMICS","M",10.76,null,null,null,null,null,null,null,4,1,null,"","",null,"","","","","","",null,551,"","","","","",""]
[16177,"GONZÁLEZ Alex","BEN-2","CASTDF","M",1.3900000000000001,null,null,null,null,null,null,null,2,1,null,"","",null,"","","","","","",null,552,"","","","","",""]
[16350,"GARCIA Alex","BEN-2","CASTDF","M",4.5,null,null,null,null,null,null,null,2,1,null,"","",null,"","","","","","",null,553,"","","","","",""]
[14064,"ESTEVE Isaac","INF-2","CALEL","M",0,null,null,null,null,null,null,null,4,1,null,"","",null,{"$f":"IF(AND($O558=1,OR($L$1=$D558,$L$2=$D558)),A558,\"\")","v":""},"","","","","",null,554,"","","","","",""]
[16970,"TEJÓN Martina","BEN-2","INDEPE","F",2.25,null,null,null,null,null,null,null,2,1,null,"","",null,{"$f":"IF(AND($O559=1,OR($L$1=$D559,$L$2=$D559)),A559,\"\")","v":""},"","","","","",null,555,"","","","","",""]
[17217,"RICLOT Oscar","INF-1","S.CUGA","M",5.67,null,null,null,null,null,null,null,4,1,null,"","",null,"","","","","","",null,556,"",{"$f":"IF(AND($L$1=\"\",$L$2=\"\"),\"\",IF($AA560>$Q$3-$Q$2+1,\"\",VLOOKUP($AA560,$R$5:$Y$600,AC$3,0)))","v":""},"","","",""]
[16707,"VICIENT Zeus","BEN-2","ATEN82","M",0,null,null,null,null,null,null,null,2,1,null,"","",null,"","","","","","",null,557,"","","","","",""]
[17246,"SURIOL Joan","INF-1","VILAFR","M",7.62,null,null,null,null,null,null,null,4,1,null,"","",null,"","","","","","",null,558,"","","","","",""]
[17226,"CARLO Enzo","INF-1","BADALO","M",10.83,null,null,null,null,null,null,null,4,1,null,"","",null,"","","","","","",null,559,"","","","","",""]
[16873,"TERRAZA David","ALE-2","JOVCTDF","M",2.87,null,null,null,null,null,null,null,3,1,null,"","",null,"","","","","","",null,560,"","","","","",""]
[9044,"VEGA Lucia","INF-2","JOVCTDF","F",4,null,null,null,null,null,null,null,4,1,null,"","",null,"","","","","","",null,561,"","","","","",""]
[16704,"SALVADOR Miguel Angel","ALE-1","JOVCTDF","M",2.86,null,null,null,null,null,null,null,3,1,null,"","",null,"","","","","","",null,562,"","","","","",""]
[17290,"ALUJA Joaquim","BEN-2","INDEPE","M",0.82,null,null,null,null,null,null,null,2,1,null,"","",null,"","","","","","",null,563,"","","","","",""]
[17049,"KLOCKNER Max Pau","PRE-0","JOVCTDF","M",1.8399999999999999,null,null,null,null,null,null,null,1,1,null,"","",null,"","","","","","",null,564,"","","","","",""]
[15557,"BALASTEGUI Abril","BEN-1","CNSABA","F",1.58,null,null,null,null,null,null,null,2,1,null,"","",null,"","","","","","",null,565,"","","","","",""]
[17309,"JURADO Laia","ALE-1","CNSABA","F",0.5,null,null,null,null,null,null,null,3,1,null,"","",null,"","","","","","",null,566,"",{"$f":"IF(AND($L$1=\"\",$L$2=\"\"),\"\",IF($AA570>$Q$3-$Q$2+1,\"\",VLOOKUP($AA570,$R$5:$Y$600,AC$3,0)))","v":""},"","","",""]
[17337,"TOR Oriol","BEN-1","INDEPE","M",1.88,null,null,null,null,null,null,null,2,1,null,"","",null,"","","","","","",null,567,"","","","","",""]
[17338,"PRADA Marc","ALE-2","VILASS","M",2.98,null,null,null,null,null,null,null,3,1,null,"","",null,"","","","","","",null,568,"","","","","",""]
[16977,"PRADES Nel","BEN-2","CARDED","M",2.21,null,null,null,null,null,null,null,2,1,null,"","",null,"","","","","","",null,569,"","","","","",""]
[17339,"PARERA Pol","PRE-0","CARDED","M",2.7199999999999998,null,null,null,null,null,null,null,1,1,null,"","",null,"","","","","","",null,570,"","","","","",""]
[17034,"DUDZIC David","INF-2","VICTT","M",3.7,null,null,null,null,null,null,null,4,1,null,"","",null,"","","","","","",null,571,"","","","","",""]
[17167,"DUDZIC Victoria","PRE-0","VICTT","F",1.5699999999999998,null,null,null,null,null,null,null,1,1,null,"","",null,"","","","","","",null,572,"","","","","",""]
[17168,"DUDZIC Veronica","PRE-0","VICTT","F",1.65,null,null,null,null,null,null,null,1,1,null,"","",null,"","","","","","",null,573,"","","","","",""]
[11868,"BOUCHERIE Olau","ALE-1","AMICS","M",0,null,null,null,null,null,null,null,3,1,null,"","",null,"","","","","","",null,574,"","","","","",""]
[15556,"LLONCH Roger","ALE-2","CNSABA","M",0.53,null,null,null,null,null,null,null,3,1,null,"","",null,"","","","","","",null,575,"","","","","",""]
["","","","","",""]
["","MAX","","","",""]
["",{"$f":"MAX(B584:B598)","v":0},"",3,4,5,6,7,8,9,10]
["","","","","",""]
[null,{"$f":"IF(Hoja1!K279<>\"INSCRIPCIÓ COMPLETA\",\"\",MAX(B$583:B583)+1)","v":""},1,{"$f":"IF(Hoja1!K279=\"INSCRIPCIÓ COMPLETA\",IF(Hoja1!K230=\"\",\"\",Hoja1!K230),\"\")","v":""},{"$f":"IF(Hoja1!K279=\"INSCRIPCIÓ COMPLETA\",IF(Hoja1!K246=\"\",\"\",Hoja1!K246),\"\")","v":""},{"$f":"IF(Hoja1!K279=\"INSCRIPCIÓ COMPLETA\",IF(Hoja1!K296=\"\",\"\",Hoja1!K296),\"\")","v":""},{"$f":"IF(Hoja1!K279=\"INSCRIPCIÓ COMPLETA\",IF(Hoja1!I263=\"\",\"\",Hoja1!I263),\"\")","v":""},{"$f":"IF(Hoja1!K279=\"INSCRIPCIÓ COMPLETA\",IF(Hoja1!J263=\"\",\"\",Hoja1!J263),\"\")","v":""},{"$f":"IF(Hoja1!K279=\"INSCRIPCIÓ COMPLETA\",IF(Hoja1!K263=\"\",\"\",Hoja1!K263),\"\")","v":""},{"$f":"IF(Hoja1!K279=\"INSCRIPCIÓ COMPLETA\",IF(Hoja1!L263=\"\",\"\",Hoja1!L263),\"\")","v":""},{"$f":"IF(Hoja1!K279=\"INSCRIPCIÓ COMPLETA\",IF(Hoja1!M263=\"\",\"\",Hoja1!M263),\"\")","v":""}]
[null,{"$f":"IF(Hoja1!K280<>\"INSCRIPCIÓ COMPLETA\",\"\",MAX(B$583:B584)+1)","v":""},{"$f":"C584+1","v":2},{"$f":"IF(Hoja1!K280=\"INSCRIPCIÓ COMPLETA\",IF(Hoja1!K231=\"\",\"\",Hoja1!K231),\"\")","v":""},{"$f":"IF(Hoja1!K280=\"INSCRIPCIÓ COMPLETA\",IF(Hoja1!K247=\"\",\"\",Hoja1!K247),\"\")","v":""},{"$f":"IF(Hoja1!K280=\"INSCRIPCIÓ COMPLETA\",IF(Hoja1!K297=\"\",\"\",Hoja1!K297),\"\")","v":""},{"$f":"IF(Hoja1!K280=\"INSCRIPCIÓ COMPLETA\",IF(Hoja1!I264=\"\",\"\",Hoja1!I264),\"\")","v":""},{"$f":"IF(Hoja1!K280=\"INSCRIPCIÓ COMPLETA\",IF(Hoja1!J264=\"\",\"\",Hoja1!J264),\"\")","v":""},{"$f":"IF(Hoja1!K280=\"INSCRIPCIÓ COMPLETA\",IF(Hoja1!K264=\"\",\"\",Hoja1!K264),\"\")","v":""},{"$f":"IF(Hoja1!K280=\"INSCRIPCIÓ COMPLETA\",IF(Hoja1!L264=\"\",\"\",Hoja1!L264),\"\")","v":""},{"$f":"IF(Hoja1!K280=\"INSCRIPCIÓ COMPLETA\",IF(Hoja1!M264=\"\",\"\",Hoja1!M264),\"\")","v":""}]
[null,{"$f":"IF(Hoja1!K281<>\"INSCRIPCIÓ COMPLETA\",\"\",MAX(B$583:B585)+1)","v":""},{"$f":"C585+1","v":3},{"$f":"IF(Hoja1!K281=\"INSCRIPCIÓ COMPLETA\",IF(Hoja1!K232=\"\",\"\",Hoja1!K232),\"\")","v":""},{"$f":"IF(Hoja1!K281=\"INSCRIPCIÓ COMPLETA\",IF(Hoja1!K248=\"\",\"\",Hoja1!K248),\"\")","v":""},{"$f":"IF(Hoja1!K281=\"INSCRIPCIÓ COMPLETA\",IF(Hoja1!K298=\"\",\"\",Hoja1!K298),\"\")","v":""},{"$f":"IF(Hoja1!K281=\"INSCRIPCIÓ COMPLETA\",IF(Hoja1!I265=\"\",\"\",Hoja1!I265),\"\")","v":""},{"$f":"IF(Hoja1!K281=\"INSCRIPCIÓ COMPLETA\",IF(Hoja1!J265=\"\",\"\",Hoja1!J265),\"\")","v":""},{"$f":"IF(Hoja1!K281=\"INSCRIPCIÓ COMPLETA\",IF(Hoja1!K265=\"\",\"\",Hoja1!K265),\"\")","v":""},{"$f":"IF(Hoja1!K281=\"INSCRIPCIÓ COMPLETA\",IF(Hoja1!L265=\"\",\"\",Hoja1!L265),\"\")","v":""},{"$f":"IF(Hoja1!K281=\"INSCRIPCIÓ COMPLETA\",IF(Hoja1!M265=\"\",\"\",Hoja1!M265),\"\")","v":""}]
[null,{"$f":"IF(Hoja1!K282<>\"INSCRIPCIÓ COMPLETA\",\"\",MAX(B$583:B586)+1)","v":""},4,{"$f":"IF(Hoja1!K282=\"INSCRIPCIÓ COMPLETA\",IF(Hoja1!K233=\"\",\"\",Hoja1!K233),\"\")","v":""},{"$f":"IF(Hoja1!K282=\"INSCRIPCIÓ COMPLETA\",IF(Hoja1!K249=\"\",\"\",Hoja1!K249),\"\")","v":""},{"$f":"IF(Hoja1!K282=\"INSCRIPCIÓ COMPLETA\",IF(Hoja1!K299=\"\",\"\",Hoja1!K299),\"\")","v":""},{"$f":"IF(Hoja1!K282=\"INSCRIPCIÓ COMPLETA\",IF(Hoja1!I266=\"\",\"\",Hoja1!I266),\"\")","v":""},{"$f":"IF(Hoja1!K282=\"INSCRIPCIÓ COMPLETA\",IF(Hoja1!J266=\"\",\"\",Hoja1!J266),\"\")","v":""},{"$f":"IF(Hoja1!K282=\"INSCRIPCIÓ COMPLETA\",IF(Hoja1!K266=\"\",\"\",Hoja1!K266),\"\")","v":""},{"$f":"IF(Hoja1!K282=\"INSCRIPCIÓ COMPLETA\",IF(Hoja1!L266=\"\",\"\",Hoja1!L266),\"\")","v":""},{"$f":"IF(Hoja1!K282=\"INSCRIPCIÓ COMPLETA\",IF(Hoja1!M266=\"\",\"\",Hoja1!M266),\"\")","v":""}]
[null,{"$f":"IF(Hoja1!K283<>\"INSCRIPCIÓ COMPLETA\",\"\",MAX(B$583:B587)+1)","v":""},5,{"$f":"IF(Hoja1!K283=\"INSCRIPCIÓ COMPLETA\",IF(Hoja1!K234=\"\",\"\",Hoja1!K234),\"\")","v":""},{"$f":"IF(Hoja1!K283=\"INSCRIPCIÓ COMPLETA\",IF(Hoja1!K250=\"\",\"\",Hoja1!K250),\"\")","v":""},{"$f":"IF(Hoja1!K283=\"INSCRIPCIÓ COMPLETA\",IF(Hoja1!K300=\"\",\"\",Hoja1!K300),\"\")","v":""},{"$f":"IF(Hoja1!K283=\"INSCRIPCIÓ COMPLETA\",IF(Hoja1!I267=\"\",\"\",Hoja1!I267),\"\")","v":""},{"$f":"IF(Hoja1!K283=\"INSCRIPCIÓ COMPLETA\",IF(Hoja1!J267=\"\",\"\",Hoja1!J267),\"\")","v":""},{"$f":"IF(Hoja1!K283=\"INSCRIPCIÓ COMPLETA\",IF(Hoja1!K267=\"\",\"\",Hoja1!K267),\"\")","v":""},{"$f":"IF(Hoja1!K283=\"INSCRIPCIÓ COMPLETA\",IF(Hoja1!L267=\"\",\"\",Hoja1!L267),\"\")","v":""},{"$f":"IF(Hoja1!K283=\"INSCRIPCIÓ COMPLETA\",IF(Hoja1!M267=\"\",\"\",Hoja1!M267),\"\")","v":""}]
[null,{"$f":"IF(Hoja1!K284<>\"INSCRIPCIÓ COMPLETA\",\"\",MAX(B$583:B588)+1)","v":""},6,{"$f":"IF(Hoja1!K284=\"INSCRIPCIÓ COMPLETA\",IF(Hoja1!K235=\"\",\"\",Hoja1!K235),\"\")","v":""},{"$f":"IF(Hoja1!K284=\"INSCRIPCIÓ COMPLETA\",IF(Hoja1!K251=\"\",\"\",Hoja1!K251),\"\")","v":""},{"$f":"IF(Hoja1!K284=\"INSCRIPCIÓ COMPLETA\",IF(Hoja1!K301=\"\",\"\",Hoja1!K301),\"\")","v":""},{"$f":"IF(Hoja1!K284=\"INSCRIPCIÓ COMPLETA\",IF(Hoja1!I268=\"\",\"\",Hoja1!I268),\"\")","v":""},{"$f":"IF(Hoja1!K284=\"INSCRIPCIÓ COMPLETA\",IF(Hoja1!J268=\"\",\"\",Hoja1!J268),\"\")","v":""},{"$f":"IF(Hoja1!K284=\"INSCRIPCIÓ COMPLETA\",IF(Hoja1!K268=\"\",\"\",Hoja1!K268),\"\")","v":""},{"$f":"IF(Hoja1!K284=\"INSCRIPCIÓ COMPLETA\",IF(Hoja1!L268=\"\",\"\",Hoja1!L268),\"\")","v":""},{"$f":"IF(Hoja1!K284=\"INSCRIPCIÓ COMPLETA\",IF(Hoja1!M268=\"\",\"\",Hoja1!M268),\"\")","v":""}]
[null,{"$f":"IF(Hoja1!K285<>\"INSCRIPCIÓ COMPLETA\",\"\",MAX(B$583:B589)+1)","v":""},7,{"$f":"IF(Hoja1!K285=\"INSCRIPCIÓ COMPLETA\",IF(Hoja1!K236=\"\",\"\",Hoja1!K236),\"\")","v":""},{"$f":"IF(Hoja1!K285=\"INSCRIPCIÓ COMPLETA\",IF(Hoja1!K252=\"\",\"\",Hoja1!K252),\"\")","v":""},{"$f":"IF(Hoja1!K285=\"INSCRIPCIÓ COMPLETA\",IF(Hoja1!K302=\"\",\"\",Hoja1!K302),\"\")","v":""},{"$f":"IF(Hoja1!K285=\"INSCRIPCIÓ COMPLETA\",IF(Hoja1!I269=\"\",\"\",Hoja1!I269),\"\")","v":""},{"$f":"IF(Hoja1!K285=\"INSCRIPCIÓ COMPLETA\",IF(Hoja1!J269=\"\",\"\",Hoja1!J269),\"\")","v":""},{"$f":"IF(Hoja1!K285=\"INSCRIPCIÓ COMPLETA\",IF(Hoja1!K269=\"\",\"\",Hoja1!K269),\"\")","v":""},{"$f":"IF(Hoja1!K285=\"INSCRIPCIÓ COMPLETA\",IF(Hoja1!L269=\"\",\"\",Hoja1!L269),\"\")","v":""},{"$f":"IF(Hoja1!K285=\"INSCRIPCIÓ COMPLETA\",IF(Hoja1!M269=\"\",\"\",Hoja1!M269),\"\")","v":""}]
[null,{"$f":"IF(Hoja1!K286<>\"INSCRIPCIÓ COMPLETA\",\"\",MAX(B$583:B590)+1)","v":""},8,{"$f":"IF(Hoja1!K286=\"INSCRIPCIÓ COMPLETA\",IF(Hoja1!K237=\"\",\"\",Hoja1!K237),\"\")","v":""},{"$f":"IF(Hoja1!K286=\"INSCRIPCIÓ COMPLETA\",IF(Hoja1!K253=\"\",\"\",Hoja1!K253),\"\")","v":""},{"$f":"IF(Hoja1!K286=\"INSCRIPCIÓ COMPLETA\",IF(Hoja1!K303=\"\",\"\",Hoja1!K303),\"\")","v":""},{"$f":"IF(Hoja1!K286=\"INSCRIPCIÓ COMPLETA\",IF(Hoja1!I270=\"\",\"\",Hoja1!I270),\"\")","v":""},{"$f":"IF(Hoja1!K286=\"INSCRIPCIÓ COMPLETA\",IF(Hoja1!J270=\"\",\"\",Hoja1!J270),\"\")","v":""},{"$f":"IF(Hoja1!K286=\"INSCRIPCIÓ COMPLETA\",IF(Hoja1!K270=\"\",\"\",Hoja1!K270),\"\")","v":""},{"$f":"IF(Hoja1!K286=\"INSCRIPCIÓ COMPLETA\",IF(Hoja1!L270=\"\",\"\",Hoja1!L270),\"\")","v":""},{"$f":"IF(Hoja1!K286=\"INSCRIPCIÓ COMPLETA\",IF(Hoja1!M270=\"\",\"\",Hoja1!M270),\"\")","v":""}]
[null,{"$f":"IF(Hoja1!K287<>\"INSCRIPCIÓ COMPLETA\",\"\",MAX(B$583:B591)+1)","v":""},9,{"$f":"IF(Hoja1!K287=\"INSCRIPCIÓ COMPLETA\",IF(Hoja1!K238=\"\",\"\",Hoja1!K238),\"\")","v":""},{"$f":"IF(Hoja1!K287=\"INSCRIPCIÓ COMPLETA\",IF(Hoja1!K254=\"\",\"\",Hoja1!K254),\"\")","v":""},{"$f":"IF(Hoja1!K287=\"INSCRIPCIÓ COMPLETA\",IF(Hoja1!K304=\"\",\"\",Hoja1!K304),\"\")","v":""},{"$f":"IF(Hoja1!K287=\"INSCRIPCIÓ COMPLETA\",IF(Hoja1!I271=\"\",\"\",Hoja1!I271),\"\")","v":""},{"$f":"IF(Hoja1!K287=\"INSCRIPCIÓ COMPLETA\",IF(Hoja1!J271=\"\",\"\",Hoja1!J271),\"\")","v":""},{"$f":"IF(Hoja1!K287=\"INSCRIPCIÓ COMPLETA\",IF(Hoja1!K271=\"\",\"\",Hoja1!K271),\"\")","v":""},{"$f":"IF(Hoja1!K287=\"INSCRIPCIÓ COMPLETA\",IF(Hoja1!L271=\"\",\"\",Hoja1!L271),\"\")","v":""},{"$f":"IF(Hoja1!K287=\"INSCRIPCIÓ COMPLETA\",IF(Hoja1!M271=\"\",\"\",Hoja1!M271),\"\")","v":""}]
[null,{"$f":"IF(Hoja1!K288<>\"INSCRIPCIÓ COMPLETA\",\"\",MAX(B$583:B592)+1)","v":""},10,{"$f":"IF(Hoja1!K288=\"INSCRIPCIÓ COMPLETA\",IF(Hoja1!K239=\"\",\"\",Hoja1!K239),\"\")","v":""},{"$f":"IF(Hoja1!K288=\"INSCRIPCIÓ COMPLETA\",IF(Hoja1!K255=\"\",\"\",Hoja1!K255),\"\")","v":""},{"$f":"IF(Hoja1!K288=\"INSCRIPCIÓ COMPLETA\",IF(Hoja1!K305=\"\",\"\",Hoja1!K305),\"\")","v":""},{"$f":"IF(Hoja1!K288=\"INSCRIPCIÓ COMPLETA\",IF(Hoja1!I272=\"\",\"\",Hoja1!I272),\"\")","v":""},{"$f":"IF(Hoja1!K288=\"INSCRIPCIÓ COMPLETA\",IF(Hoja1!J272=\"\",\"\",Hoja1!J272),\"\")","v":""},{"$f":"IF(Hoja1!K288=\"INSCRIPCIÓ COMPLETA\",IF(Hoja1!K272=\"\",\"\",Hoja1!K272),\"\")","v":""},{"$f":"IF(Hoja1!K288=\"INSCRIPCIÓ COMPLETA\",IF(Hoja1!L272=\"\",\"\",Hoja1!L272),\"\")","v":""},{"$f":"IF(Hoja1!K288=\"INSCRIPCIÓ COMPLETA\",IF(Hoja1!M272=\"\",\"\",Hoja1!M272),\"\")","v":""}]
[null,{"$f":"IF(Hoja1!K289<>\"INSCRIPCIÓ COMPLETA\",\"\",MAX(B$583:B593)+1)","v":""},11,{"$f":"IF(Hoja1!K289=\"INSCRIPCIÓ COMPLETA\",IF(Hoja1!K240=\"\",\"\",Hoja1!K240),\"\")","v":""},{"$f":"IF(Hoja1!K289=\"INSCRIPCIÓ COMPLETA\",IF(Hoja1!K256=\"\",\"\",Hoja1!K256),\"\")","v":""},{"$f":"IF(Hoja1!K289=\"INSCRIPCIÓ COMPLETA\",IF(Hoja1!K306=\"\",\"\",Hoja1!K306),\"\")","v":""},{"$f":"IF(Hoja1!K289=\"INSCRIPCIÓ COMPLETA\",IF(Hoja1!I273=\"\",\"\",Hoja1!I273),\"\")","v":""},{"$f":"IF(Hoja1!K289=\"INSCRIPCIÓ COMPLETA\",IF(Hoja1!J273=\"\",\"\",Hoja1!J273),\"\")","v":""},{"$f":"IF(Hoja1!K289=\"INSCRIPCIÓ COMPLETA\",IF(Hoja1!K273=\"\",\"\",Hoja1!K273),\"\")","v":""},{"$f":"IF(Hoja1!K289=\"INSCRIPCIÓ COMPLETA\",IF(Hoja1!L273=\"\",\"\",Hoja1!L273),\"\")","v":""},{"$f":"IF(Hoja1!K289=\"INSCRIPCIÓ COMPLETA\",IF(Hoja1!M273=\"\",\"\",Hoja1!M273),\"\")","v":""}]
[null,{"$f":"IF(Hoja1!K290<>\"INSCRIPCIÓ COMPLETA\",\"\",MAX(B$583:B594)+1)","v":""},12,{"$f":"IF(Hoja1!K290=\"INSCRIPCIÓ COMPLETA\",IF(Hoja1!K241=\"\",\"\",Hoja1!K241),\"\")","v":""},{"$f":"IF(Hoja1!K290=\"INSCRIPCIÓ COMPLETA\",IF(Hoja1!K257=\"\",\"\",Hoja1!K257),\"\")","v":""},{"$f":"IF(Hoja1!K290=\"INSCRIPCIÓ COMPLETA\",IF(Hoja1!K307=\"\",\"\",Hoja1!K307),\"\")","v":""},{"$f":"IF(Hoja1!K290=\"INSCRIPCIÓ COMPLETA\",IF(Hoja1!I274=\"\",\"\",Hoja1!I274),\"\")","v":""},{"$f":"IF(Hoja1!K290=\"INSCRIPCIÓ COMPLETA\",IF(Hoja1!J274=\"\",\"\",Hoja1!J274),\"\")","v":""},{"$f":"IF(Hoja1!K290=\"INSCRIPCIÓ COMPLETA\",IF(Hoja1!K274=\"\",\"\",Hoja1!K274),\"\")","v":""},{"$f":"IF(Hoja1!K290=\"INSCRIPCIÓ COMPLETA\",IF(Hoja1!L274=\"\",\"\",Hoja1!L274),\"\")","v":""},{"$f":"IF(Hoja1!K290=\"INSCRIPCIÓ COMPLETA\",IF(Hoja1!M274=\"\",\"\",Hoja1!M274),\"\")","v":""}]
[null,{"$f":"IF(Hoja1!K291<>\"INSCRIPCIÓ COMPLETA\",\"\",MAX(B$583:B595)+1)","v":""},13,{"$f":"IF(Hoja1!K291=\"INSCRIPCIÓ COMPLETA\",IF(Hoja1!K242=\"\",\"\",Hoja1!K242),\"\")","v":""},{"$f":"IF(Hoja1!K291=\"INSCRIPCIÓ COMPLETA\",IF(Hoja1!K258=\"\",\"\",Hoja1!K258),\"\")","v":""},{"$f":"IF(Hoja1!K291=\"INSCRIPCIÓ COMPLETA\",IF(Hoja1!K308=\"\",\"\",Hoja1!K308),\"\")","v":""},{"$f":"IF(Hoja1!K291=\"INSCRIPCIÓ COMPLETA\",IF(Hoja1!I275=\"\",\"\",Hoja1!I275),\"\")","v":""},{"$f":"IF(Hoja1!K291=\"INSCRIPCIÓ COMPLETA\",IF(Hoja1!J275=\"\",\"\",Hoja1!J275),\"\")","v":""},{"$f":"IF(Hoja1!K291=\"INSCRIPCIÓ COMPLETA\",IF(Hoja1!K275=\"\",\"\",Hoja1!K275),\"\")","v":""},{"$f":"IF(Hoja1!K291=\"INSCRIPCIÓ COMPLETA\",IF(Hoja1!L275=\"\",\"\",Hoja1!L275),\"\")","v":""},{"$f":"IF(Hoja1!K291=\"INSCRIPCIÓ COMPLETA\",IF(Hoja1!M275=\"\",\"\",Hoja1!M275),\"\")","v":""}]
[null,{"$f":"IF(Hoja1!K292<>\"INSCRIPCIÓ COMPLETA\",\"\",MAX(B$583:B596)+1)","v":""},14,{"$f":"IF(Hoja1!K292=\"INSCRIPCIÓ COMPLETA\",IF(Hoja1!K243=\"\",\"\",Hoja1!K243),\"\")","v":""},{"$f":"IF(Hoja1!K292=\"INSCRIPCIÓ COMPLETA\",IF(Hoja1!K259=\"\",\"\",Hoja1!K259),\"\")","v":""},{"$f":"IF(Hoja1!K292=\"INSCRIPCIÓ COMPLETA\",IF(Hoja1!K309=\"\",\"\",Hoja1!K309),\"\")","v":""},{"$f":"IF(Hoja1!K292=\"INSCRIPCIÓ COMPLETA\",IF(Hoja1!I276=\"\",\"\",Hoja1!I276),\"\")","v":""},{"$f":"IF(Hoja1!K292=\"INSCRIPCIÓ COMPLETA\",IF(Hoja1!J276=\"\",\"\",Hoja1!J276),\"\")","v":""},{"$f":"IF(Hoja1!K292=\"INSCRIPCIÓ COMPLETA\",IF(Hoja1!K276=\"\",\"\",Hoja1!K276),\"\")","v":""},{"$f":"IF(Hoja1!K292=\"INSCRIPCIÓ COMPLETA\",IF(Hoja1!L276=\"\",\"\",Hoja1!L276),\"\")","v":""},{"$f":"IF(Hoja1!K292=\"INSCRIPCIÓ COMPLETA\",IF(Hoja1!M276=\"\",\"\",Hoja1!M276),\"\")","v":""}]
[null,{"$f":"IF(Hoja1!K293<>\"INSCRIPCIÓ COMPLETA\",\"\",MAX(B$583:B597)+1)","v":""},15,{"$f":"IF(Hoja1!K293=\"INSCRIPCIÓ COMPLETA\",IF(Hoja1!K244=\"\",\"\",Hoja1!K244),\"\")","v":""},{"$f":"IF(Hoja1!K293=\"INSCRIPCIÓ COMPLETA\",IF(Hoja1!K260=\"\",\"\",Hoja1!K260),\"\")","v":""},{"$f":"IF(Hoja1!K293=\"INSCRIPCIÓ COMPLETA\",IF(Hoja1!K310=\"\",\"\",Hoja1!K310),\"\")","v":""},{"$f":"IF(Hoja1!K293=\"INSCRIPCIÓ COMPLETA\",IF(Hoja1!I277=\"\",\"\",Hoja1!I277),\"\")","v":""},{"$f":"IF(Hoja1!K293=\"INSCRIPCIÓ COMPLETA\",IF(Hoja1!J277=\"\",\"\",Hoja1!J277),\"\")","v":""},{"$f":"IF(Hoja1!K293=\"INSCRIPCIÓ COMPLETA\",IF(Hoja1!K277=\"\",\"\",Hoja1!K277),\"\")","v":""},{"$f":"IF(Hoja1!K293=\"INSCRIPCIÓ COMPLETA\",IF(Hoja1!L277=\"\",\"\",Hoja1!L277),\"\")","v":""},{"$f":"IF(Hoja1!K293=\"INSCRIPCIÓ COMPLETA\",IF(Hoja1!M277=\"\",\"\",Hoja1!M277),\"\")","v":""}]
["","","","","",""]
["","","","","",""]
["","","","","",""]
["","","","","",""]
["","","","","",""]
["","","","","",""]
["","","","","",""]
["","","","","",""]
["","","","","",""]
["","","","","",""]
["","","","","",""]
["","","","","",""]
["","","","","",""]
["","","","","",""]
["","","","","",""]
["","","","","",""]
["","","","","",""]
["","","","","",""]
["","","","","",""]
["","","","","",""]
["","","","","",""]
["","","","","",""]
["","","","","",""]
["","","","","",""]
["","","","","",""]
["","","","","",""]
["","","","","",""]
["","","","","",""]
["","","","","",""]
["","","","","",""]
["","","","","",""]
["","","","","",""]
["","","","","",""]
["","","","","",""]
["","","","","",""]
["","","","","",""]
["","","","","",""]
["","","","","",""]
["","","","","",""]
["","","","","",""]
["","","","","",""]
["","","","","",""]
["","","","","",""]
["","","","","",""]
["","","","","",""]
["","","","","",""]
["","","","","",""]
["","","","","",""]
["","","","","",""]
["","","","","",""]
["","","","","",""]
["","","","","",""]
["","","","","",""]
["","","","","",""]
["","","","","",""]
["","","","","",""]
["","","","","",""]
["","","","","",""]
["","","","","",""]
["","","","","",""]
["","","","","",""]
["","","","","",""]
["","","","","",""]
["","","","","",""]
["","","","","",""]
["","","","","",""]
["","","","","",""]
["","","","","",""]
["","","","","",""]
["","","","","",""]
["","","","","",""]
["","","","","",""]
["","","","","",""]
["","","","","",""]
["","","","","",""]
["","","","","",""]
["","","","","",""]
["","","","","",""]
["","","","","",""]
["","","","","",""]
["","","","","",""]
["","","","","",""]
["","","","","",""]
["","","","","",""]
["","","","","",""]
["","","","","",""]
["","","","","",""]
["","","","","",""]
["","","","","",""]
["","","","","",""]
["","","","","",""]
["","","","","",""]
["","","","","",""]
["","","","","",""]
["","","","","",""]
["","","","","",""]
["","","","","",""]
["","","","","",""]
["","","","","",""]
["","","","","",""]
["","","","","",""]
["","","","","",""]
["","","","","",""]
["","","","","",""]
["","","","","",""]
["","","","","",""]
["","","","","",""]
["","","","","",""]
["","","","","",""]
["","","","","",""]
["","","","","",""]
["","","","","",""]
["","","","","",""]
["","","","","",""]
["","","","","",""]
["","","","","",""]
["","","","","",""]
["","","","","",""]
["","","","","",""]
["","","","","",""]
["","","","","",""]
["","","","","",""]
["","","","","",""]
["","","","","",""]
["","","","","",""]
["","","","","",""]
["","","","","",""]
["","","","","",""]
["","","","","",""]
["","","","","",""]
["","","","","",""]
["","","","","",""]
["","","","","",""]
["","","","","",""]
["","","","","",""]
["","","","","",""]
["","","","","",""]
["","","","","",""]
["","","","","",""]
["","","","","",""]
["","","","","",""]
["","","","","",""]
["","","","","",""]
["","","","","",""]
["","","","","",""]
["","","","","",""]
["","","","","",""]
["","","","","",""]
["","","","","",""]
["","","","","",""]
["","","","","",""]
["","","","","",""]
["","","","","",""]
["","","","","",""]
["","","","","",""]
["","","","","",""]
["","","","","",""]
["","","","","",""]
["","","","","",""]
["","","","","",""]
["","","","","",""]
["","","","","",""]
["","","","","",""]
["","","","","",""]
["","","","","",""]
["","","","","",""]
["","","","","",""]
["","","","","",""]
["","","","","",""]
["","","","","",""]
["","","","","",""]
["","","","","",""]
["","","","","",""]
["","","","","",""]
["","","","","",""]
["","","","","",""]
["","","","","",""]
["","","","","",""]
["","","","","",""]
["","","","","",""]
["","","","","",""]
["","","","","",""]
["","","","","",""]
["","","","","",""]
["","","","","",""]
["","","","","",""]
["","","","","",""]
["","","","","",""]
["","","","","",""]
["","","","","",""]
["","","","","",""]
["","","","","",""]
["","","","","",""]
["","","","","",""]
["","","","","",""]
["","","","","",""]
["","","","","",""]
["","","","","",""]
["","","","","",""]
["","","","","",""]
["","","","","",""]
["","","","","",""]
["","","","","",""]
["","","","","",""]
["","","","","",""]
["","","","","",""]
["","","","","",""]
["","","","","",""]
["","","","","",""]
["","","","","",""]
["","","","","",""]
["","","","","",""]
["","","","","",""]
["","","","","",""]
["","","","","",""]
["","","","","",""]
["","","","","",""]
["","","","","",""]
["","","","","",""]
["","","","","",""]
["","","","","",""]
["","","","","",""]
["","","","","",""]
["","","","","",""]
["","","","","",""]
["","","","","",""]
["","","","","",""]
["","","","","",""]
["","","","","",""]
["","","","","",""]
["","","","","",""]
["","","","","",""]
["","","","","",""]
["","","","","",""]
["","","","","",""]
["","","","","",""]
["","","","","",""]
["","","","","",""]
["","","","","",""]
["","","","","",""]
["","","","","",""]
["","","","","",""]
["","","","","",""]
["","","","","",""]
["","","","","",""]
["","","","","",""]
["","","","","",""]
["","","","","",""]
["","","","","",""]
["","","","","",""]
["","","","","",""]
["","","","","",""]
["","","","","",""]
["","","","","",""]
["","","","","",""]
["","","","","",""]
["","","","","",""]
["","","","","",""]
["","","","","",""]
["","","","","",""]
["","","","","",""]
["","","","","",""]
["","","","","",""]
["","","","","",""]
["","","","","",""]
["","","","","",""]
["","","","","",""]
["","","","","",""]
["","","","","",""]
["","","","","",""]
["","","","","",""]
["","","","","",""]
["","","","","",""]
["","","","","",""]
["","","","","",""]
["","","","","",""]
["","","","","",""]
["","","","","",""]
["","","","","",""]
["","","","","",""]
["","","","","",""]
["","","","","",""]
["","","","","",""]
["","","","","",""]
["","","","","",""]
["","","","","",""]
["","","","","",""]
["","","","","",""]
["","","","","",""]
["","","","","",""]
["","","","","",""]
["","","","","",""]
["","","","","",""]
["","","","","",""]
["","","","","",""]
["","","","","",""]
["","","","","",""]
["","","","","",""]
["","","","","",""]
["","","","","",""]
["","","","","",""]
["","","","","",""]
["","","","","",""]
["","","","","",""]
["","","","","",""]
["","","","","",""]
["","","","","",""]
["","","","","",""]
["","","","","",""]
["","","","","",""]
["","","","","",""]
["","","","","",""]
["","","","","",""]
["","","","","",""]
["","","","","",""]
["","","","","",""]
["","","","","",""]
["","","","","",""]
["","","","","",""]
["","","","","",""]
["","","","","",""]
["","","","","",""]
["","","","","",""]
["","","","","",""]
["","","","","",""]
["","","","","",""]
["","","","","",""]
["","","","","",""]
["","","","","",""]
["","","","","",""]
["","","","","",""]
["","","","","",""]
["","","","","",""]
["","","","","",""]
["","","","","",""]
["","","","","",""]
["","","","","",""]
["","","","","",""]
["","","","","",""]
["","","","","",""]
["","","","","",""]
["","","","","",""]
["","","","","",""]
["","","","","",""]
["","","","","",""]
["","","","","",""]
["","","","","",""]
["","","","","",""]
["","","","","",""]
["","","","","",""]
["","","","","",""]
["","","","","",""]
["","","","","",""]
["","","","","",""]
["","","","","",""]
["","","","","",""]
["","","","","",""]
["","","","","",""]
["","","","","",""]
["","","","","",""]
["","","","","",""]
["","","","","",""]
["","","","","",""]
["","","","","",""]
["","","","","",""]
["","","","","",""]
["","","","","",""]
["","","","","",""]
["","","","","",""]
["","","","","",""]
["","","","","",""]
["","","","","",""]
["","","","","",""]
["","","","","",""]
["","","","","",""]
["","","","","",""]
["","","","","",""]
["","","","","",""]
["","","","","",""]
["","","","","",""]
["","","","","",""]
["","","","","",""]
["","","","","",""]
["","","","","",""]
["","","","","",""]
["","","","","",""]
["","","","","",""]
["","","","","",""]
["","","","","",""]
["","","","","",""]
["","","","","",""]
["","","","","",""]
["","","","","",""]
["","","","","",""]
["","","","","",""]
["","","","","",""]
["","","","","",""]
["","","","","",""]
["","","","","",""]
["","","","","",""]
["","","","","",""]
["","","","","",""]
["","","","","",""]
["","","","","",""]
["","","","","",""]
["","","","","",""]

{"sheet":"Hoja2","index":1,"n_rows":265,"n_cols":27,"rows_kept":265,"cut":false,"hidden":false,"merged":[[177,5,177,7],[192,5,192,7],[207,5,207,7],[222,5,222,7],[237,5,237,7],[252,5,252,7],[87,5,87,7],[102,5,102,7],[117,5,117,7],[132,5,132,7],[147,5,147,7],[162,5,162,7],[15,26,17,29],[10,26,12,29],[5,26,7,29],[42,5,42,7],[57,5,57,7],[72,5,72,7],[263,2,263,3],[264,2,264,3],[44,1,44,2],[45,1,45,2],[46,1,46,2],[47,1,47,2],[59,1,59,2],[60,1,60,2],[61,1,61,2],[62,1,62,2],[256,3,256,4],[257,3,257,4],[259,2,259,3],[260,2,260,3],[261,2,261,3],[262,2,262,3],[256,1,256,2],[257,1,257,2],[246,2,246,3],[247,2,247,3],[248,2,248,3],[249,2,249,3],[254,3,254,4],[255,3,255,4],[254,1,254,2],[255,1,255,2],[239,3,239,4],[240,3,240,4],[241,3,241,4],[242,3,242,4],[244,2,244,3],[245,2,245,3],[239,1,239,2],[240,1,240,2],[241,1,241,2],[242,1,242,2],[229,2,229,3],[230,2,230,3],[231,2,231,3],[232,2,232,3],[233,2,233,3],[234,2,234,3],[218,2,218,3],[219,2,219,3],[224,3,224,4],[225,3,225,4],[226,3,226,4],[227,3,227,4],[224,1,224,2],[225,1,225,2],[226,1,226,2],[227,1,227,2],[211,3,211,4],[212,3,212,4],[214,2,214,3],[215,2,215,3],[216,2,216,3],[217,2,217,3],[211,1,211,2],[212,1,212,2],[201,2,201,3],[202,2,202,3],[203,2,203,3],[204,2,204,3],[209,3,209,4],[210,3,210,4],[209,1,209,2],[210,1,210,2],[194,3,194,4],[195,3,195,4],[196,3,196,4],[197,3,197,4],[199,2,199,3],[200,2,200,3],[194,1,194,2],[195,1,195,2],[196,1,196,2],[197,1,197,2],[184,2,184,3],[185,2,185,3],[186,2,186,3],[187,2,187,3],[188,2,188,3],[189,2,189,3],[173,2,173,3],[174,2,174,3],[179,3,179,4],[180,3,180,4],[181,3,181,4],[182,3,182,4],[179,1,179,2],[180,1,180,2],[181,1,181,2],[182,1,182,2],[166,3,166,4],[167,3,167,4],[169,2,169,3],[170,2,170,3],[171,2,171,3],[172,2,172,3],[166,1,166,2],[167,1,167,2],[156,2,156,3],[157,2,157,3],[158,2,158,3],[159,2,159,3],[164,3,164,4],[165,3,165,4],[164,1,164,2],[165,1,165,2],[149,3,149,4],[150,3,150,4],[151,3,151,4],[152,3,152,4],[154,2,154,3],[155,2,155,3],[149,1,149,2],[150,1,150,2],[151,1,151,2],[152,1,152,2],[139,2,139,3],[140,2,140,3],[141,2,141,3],[142,2,142,3],[143,2,143,3],[144,2,144,3],[128,2,128,3],[129,2,129,3],[134,3,134,4],[135,3,135,4],[136,3,136,4],[137,3,137,4],[134,1,134,2],[135,1,135,2],[136,1,136,2],[137,1,137,2],[121,3,121,4],[122,3,122,4],[124,2,124,3],[125,2,125,3],[126,2,126,3],[127,2,127,3],[121,1,121,2],[122,1,122,2],[111,2,111,3],[112,2,112,3],[113,2,113,3],[114,2,114,3],[119,3,119,4],[120,3,120,4],[119,1,119,2],[120,1,120,2],[104,3,104,4],[105,3,105,4],[106,3,106,4],[107,3,107,4],[109,2,109,3],[110,2,110,3],[104,1,104,2],[105,1,105,2],[106,1,106,2],[107,1,107,2],[94,2,94,3],[95,2,95,3],[96,2,96,3],[97,2,97,3],[98,2,98,3],[99,2,99,3],[83,2,83,3],[84,2,84,3],[89,3,89,4],[90,3,90,4],[91,3,91,4],[92,3,92,4],[89,1,89,2],[90,1,90,2],[91,1,91,2],[92,1,92,2],[76,3,76,4],[77,3,77,4],[79,2,79,3],[80,2,80,3],[81,2,81,3],[82,2,82,3],[76,1,76,2],[77,1,77,2],[66,2,66,3],[67,2,67,3],[68,2,68,3],[69,2,69,3],[74,3,74,4],[75,3,75,4],[74,1,74,2],[75,1,75,2],[59,3,59,4],[60,3,60,4],[61,3,61,4],[62,3,62,4],[64,2,64,3],[65,2,65,3],[44,3,44,4],[45,3,45,4],[46,3,46,4],[47,3,47,4],[34,1,34,3],[36,1,36,3],[38,1,38,3],[49,2,49,3],[50,2,50,3],[51,2,51,3],[52,2,52,3],[53,2,53,3],[54,2,54,3]]}
[null,"FORMULARI D'INSCRIPCIÓ PER AL CAMPIONAT DE BARCELONA PER EQUIPS (27 I 28 DE MAIG)"]
[]
[null,"INSTRUCCIONS"]
[null,null,null,null,null,null,null,null,null,null,null,null,null,null,null,null,null,null,null,null,null,null,null,null,null,null,"FA LA INSCRIPCIÓ:"]
[null,"Només ompliu les caselles de color blau, la resta surt automàtic"]
[null,null,null,null,null,null,null,null,null,null,null,null,null,null,null,null,null,null,null,null,null,null,null,null,null,null,{"$f":"IF(B35=\"\",\"\",B35)","v":""}]
[null,"- Ompliu la casella de \"Club que tramet les inscripcions\" escollint un club de la llista desplegable. Assegureu-vos que quan guardeu l'arxiu hi apareix el vostre club, perquè serà"]
[null,"el club que constarà com qui ha fet les inscripcions i, per tant, el club que pagarà les inscripcions (tot i que l'equip estigui composat per integrants de diversos equips)."]
[null,"- Podeu omplir també les caselles \"2n club a introduir per la cerca\" i \"Categoria a omplir per la cerca\", però són opcionals, no tenen cap efecte en les inscripcions, només"]
[null,"serveixen per ampliar o restringir la cerca."]
[null,null,null,null,null,null,null,null,null,null,null,null,null,null,null,null,null,null,null,null,null,null,null,null,null,null,{"$f":"IF(COUNTBLANK(I43:I267)+COUNTIF(I43:I267,\"Correcte\")+15=225,\"INSCRIPCIONS SENSE ERRORS\",\"INSCRIPCIONS AMB ERRORS\")","v":"INSCRIPCIONS SENSE ERRORS"}]
[null,"- A l'hora de fer la inscripció de cadascun dels equips, primer de tot teniu l'opció d'acceptar el nom per defecte o canviar-lo per un altre introduint-lo a la casella \"Nom"]
[null,"modificat (opcional):\". Si canvieu el nom assegureu-vos que aquest no passa d'un màxim de 28 caràcters. No canviar el nom implica acceptar el nom per defecte."]
[null,"- A continuació escolliu la categoria en la que voleu inscriure l'equip. Tingueu en compte que si a la cerca de jugadors disponibles hi teniu introduïda una categoria diferent,"]
[null,"potser us hi apareixen jugadors/es no alineables en aquest equip. De totes formes, si poseu algun jugador/a no alineable us apareixerà un missatge d'error a la columna"]
[null,"\"Error?\", mentre que si el jugador/a és alineable la casella mostrarà un \"Correcte\".",null,null,null,null,null,null,null,null,null,null,null,null,null,null,null,null,null,null,null,null,null,null,null,null,{"$f":"IF(COUNTBLANK(Hoja1!K137:K211)=75,\"NO HI HA INSCRITS D'ALTRES CLUBS\",\"HI HA INSCRITS D'ALTRES CLUBS:\")","v":"NO HI HA INSCRITS D'ALTRES CLUBS"}]
[null,"- Introduïu un a un els números personals (números de llicència) dels components de l'equip a les caselles de la columna \"NP\". Els equips han de tenir un mínim de 2 jugadors"]
[null,"o jugadores i un màxim de 5 (no es poden insertar caselles addicionals). Assegureu-vos de que apareix un \"Correcte\" a la columna \"Error?\" després d'afegir cada NP."]
[]
[null,"- En aquest excel podeu inscriure fins un total de 15 equips. Si n'haguéssiu d'inscriure més, ompliu un altre excel com aquest per afegir les inscripcions restants. Si ho féssiu,",null,null,null,null,null,null,null,null,null,null,null,null,null,null,null,null,null,null,null,null,null,null,null,null,{"$f":"IF(Hoja1!AA5>Hoja1!$G$135,\"\",VLOOKUP(Hoja1!AA5,Hoja1!$G$137:$K$211,5,0)&\" (\"&VLOOKUP(Hoja1!AA5,Hoja1!$G$137:$K$211,4,0)&\")\")","v":""}]
[null,"assegureu-vos que no heu inscrit un mateix jugador/a 2 vegades. Si això passés, el jugador/a seria retirat de l'equip que s'hagués inscrit més tard i, si aquest equip fos",null,null,null,null,null,null,null,null,null,null,null,null,null,null,null,null,null,null,null,null,null,null,null,null,{"$f":"IF(Hoja1!AA6>Hoja1!$G$135,\"\",VLOOKUP(Hoja1!AA6,Hoja1!$G$137:$K$211,5,0)&\" (\"&VLOOKUP(Hoja1!AA6,Hoja1!$G$137:$K$211,4,0)&\")\")","v":""}]
[null,"inicialment un equip de 2 jugadors/es (i amb la retirada es quedés amb 1 jugador/a sol), la seva inscripció quedaria invalidada.",null,null,null,null,null,null,null,null,null,null,null,null,null,null,null,null,null,null,null,null,null,null,null,null,{"$f":"IF(Hoja1!AA7>Hoja1!$G$135,\"\",VLOOKUP(Hoja1!AA7,Hoja1!$G$137:$K$211,5,0)&\" (\"&VLOOKUP(Hoja1!AA7,Hoja1!$G$137:$K$211,4,0)&\")\")","v":""}]
[null,null,null,null,null,null,null,null,null,null,null,null,null,null,null,null,null,null,null,null,null,null,null,null,null,null,{"$f":"IF(Hoja1!AA8>Hoja1!$G$135,\"\",VLOOKUP(Hoja1!AA8,Hoja1!$G$137:$K$211,5,0)&\" (\"&VLOOKUP(Hoja1!AA8,Hoja1!$G$137:$K$211,4,0)&\")\")","v":""}]
[null,"ESPECIAL PER A EQUIPS AMB JUGADORS/ES DE DIFERENTS CLUBS",null,null,null,null,null,null,null,null,null,null,null,null,null,null,null,null,null,null,null,null,null,null,null,null,{"$f":"IF(Hoja1!AA9>Hoja1!$G$135,\"\",VLOOKUP(Hoja1!AA9,Hoja1!$G$137:$K$211,5,0)&\" (\"&VLOOKUP(Hoja1!AA9,Hoja1!$G$137:$K$211,4,0)&\")\")","v":""}]
[null,null,null,null,null,null,null,null,null,null,null,null,null,null,null,null,null,null,null,null,null,null,null,null,null,null,{"$f":"IF(Hoja1!AA10>Hoja1!$G$135,\"\",VLOOKUP(Hoja1!AA10,Hoja1!$G$137:$K$211,5,0)&\" (\"&VLOOKUP(Hoja1!AA10,Hoja1!$G$137:$K$211,4,0)&\")\")","v":""}]
[null,"- Quan envieu l'excel amb les inscripcions al correu de la RTB rtb@fctt.org, necessitarem també que el o els clubs de pertanyença dels jugadors/es inscrits que no siguin del",null,null,null,null,null,null,null,null,null,null,null,null,null,null,null,null,null,null,null,null,null,null,null,null,{"$f":"IF(Hoja1!AA11>Hoja1!$G$135,\"\",VLOOKUP(Hoja1!AA11,Hoja1!$G$137:$K$211,5,0)&\" (\"&VLOOKUP(Hoja1!AA11,Hoja1!$G$137:$K$211,4,0)&\")\")","v":""}]
[null,"vostre club hi siguin amb còpia i ens enviïn un 2n correu amb la conformitat amb aquestes inscripcions del seu/s jugadors/es.",null,null,null,null,null,null,null,null,null,null,null,null,null,null,null,null,null,null,null,null,null,null,null,null,{"$f":"IF(Hoja1!AA12>Hoja1!$G$135,\"\",VLOOKUP(Hoja1!AA12,Hoja1!$G$137:$K$211,5,0)&\" (\"&VLOOKUP(Hoja1!AA12,Hoja1!$G$137:$K$211,4,0)&\")\")","v":""}]
[null,"- Des de la RTB intentarem detectar si hi ha casos d'inscripcions de jugadors/es de diferents clubs en un mateix equip per assegurar-nos de que l'autorització està enviada,",null,null,null,null,null,null,null,null,null,null,null,null,null,null,null,null,null,null,null,null,null,null,null,null,{"$f":"IF(Hoja1!AA13>Hoja1!$G$135,\"\",VLOOKUP(Hoja1!AA13,Hoja1!$G$137:$K$211,5,0)&\" (\"&VLOOKUP(Hoja1!AA13,Hoja1!$G$137:$K$211,4,0)&\")\")","v":""}]
[null,"però últimament els clubs que feu les inscripcions sou responsables de que les autoritzacions arribin. Un equip inscrit amb un jugador/a d'un altre club del que no s'hagi enviat",null,null,null,null,null,null,null,null,null,null,null,null,null,null,null,null,null,null,null,null,null,null,null,null,{"$f":"IF(Hoja1!AA14>Hoja1!$G$135,\"\",VLOOKUP(Hoja1!AA14,Hoja1!$G$137:$K$211,5,0)&\" (\"&VLOOKUP(Hoja1!AA14,Hoja1!$G$137:$K$211,4,0)&\")\")","v":""}]
[null,"una autorització per correu electrònic podrà no tenir validesa tot i constar com a inscrit als llistats de la RTB si el jugador/a de l'altre club la considera invàlida i decideix",null,null,null,null,null,null,null,null,null,null,null,null,null,null,null,null,null,null,null,null,null,null,null,null,{"$f":"IF(Hoja1!AA15>Hoja1!$G$135,\"\",VLOOKUP(Hoja1!AA15,Hoja1!$G$137:$K$211,5,0)&\" (\"&VLOOKUP(Hoja1!AA15,Hoja1!$G$137:$K$211,4,0)&\")\")","v":""}]
[null,"finalment no jugar o jugar amb un altre equip. Si aquest fos el cas i això es detectés en un moment en que fos impossible substituir la seva vacant per un altre equip, no es",null,null,null,null,null,null,null,null,null,null,null,null,null,null,null,null,null,null,null,null,null,null,null,null,{"$f":"IF(Hoja1!AA16>Hoja1!$G$135,\"\",VLOOKUP(Hoja1!AA16,Hoja1!$G$137:$K$211,5,0)&\" (\"&VLOOKUP(Hoja1!AA16,Hoja1!$G$137:$K$211,4,0)&\")\")","v":""}]
[null,"retornaran els diners de la inscripció.",null,null,null,null,null,null,null,null,null,null,null,null,null,null,null,null,null,null,null,null,null,null,null,null,{"$f":"IF(Hoja1!AA17>Hoja1!$G$135,\"\",VLOOKUP(Hoja1!AA17,Hoja1!$G$137:$K$211,5,0)&\" (\"&VLOOKUP(Hoja1!AA17,Hoja1!$G$137:$K$211,4,0)&\")\")","v":""}]
[null,null,null,null,null,null,null,null,null,null,null,null,null,null,null,null,null,null,null,null,null,null,null,null,null,null,{"$f":"IF(Hoja1!AA18>Hoja1!$G$135,\"\",VLOOKUP(Hoja1!AA18,Hoja1!$G$137:$K$211,5,0)&\" (\"&VLOOKUP(Hoja1!AA18,Hoja1!$G$137:$K$211,4,0)&\")\")","v":""}]
[null,null,null,null,null,null,null,null,null,null,null,null,null,null,null,null,null,null,null,null,null,null,null,null,null,null,{"$f":"IF(Hoja1!AA19>Hoja1!$G$135,\"\",VLOOKUP(Hoja1!AA19,Hoja1!$G$137:$K$211,5,0)&\" (\"&VLOOKUP(Hoja1!AA19,Hoja1!$G$137:$K$211,4,0)&\")\")","v":""}]
[null,null,null,null,null,"<- Club que tramet les inscripcions (obligatori)",null,null,null,null,"Llistat de jugador/es que es poden inscriure segons la cerca:",null,null,null,null,null,null,null,null,null,null,null,null,null,null,null,{"$f":"IF(Hoja1!AA20>Hoja1!$G$135,\"\",VLOOKUP(Hoja1!AA20,Hoja1!$G$137:$K$211,5,0)&\" (\"&VLOOKUP(Hoja1!AA20,Hoja1!$G$137:$K$211,4,0)&\")\")","v":""}]
[null,null,null,null,null,null,null,null,null,null,null,null,null,null,null,null,null,null,null,null,null,null,null,null,null,null,{"$f":"IF(Hoja1!AA21>Hoja1!$G$135,\"\",VLOOKUP(Hoja1!AA21,Hoja1!$G$137:$K$211,5,0)&\" (\"&VLOOKUP(Hoja1!AA21,Hoja1!$G$137:$K$211,4,0)&\")\")","v":""}]
[null,null,null,null,null,"<- 2n club a introduir per la cerca (opcional)",null,null,null,null,"NP","JUGADOR/A","EDAT","CLUB","SEXE","rk tot",null,null,null,null,null,null,null,null,null,null,{"$f":"IF(Hoja1!AA22>Hoja1!$G$135,\"\",VLOOKUP(Hoja1!AA22,Hoja1!$G$137:$K$211,5,0)&\" (\"&VLOOKUP(Hoja1!AA22,Hoja1!$G$137:$K$211,4,0)&\")\")","v":""}]
[null,null,null,null,null,null,null,null,null,null,{"$f":"IF(Hoja1!AB5=\"\",\"\",Hoja1!AB5)","v":""},{"$f":"IF(Hoja1!AC5=\"\",\"\",Hoja1!AC5)","v":""},{"$f":"IF(Hoja1!AD5=\"\",\"\",Hoja1!AD5)","v":""},{"$f":"IF(Hoja1!AE5=\"\",\"\",Hoja1!AE5)","v":""},{"$f":"IF(Hoja1!AF5=\"\",\"\",Hoja1!AF5)","v":""},{"$f":"IF(Hoja1!AG5=\"\",\"\",Hoja1!AG5)","v":""},null,null,null,null,null,null,null,null,null,null,{"$f":"IF(Hoja1!AA23>Hoja1!$G$135,\"\",VLOOKUP(Hoja1!AA23,Hoja1!$G$137:$K$211,5,0)&\" (\"&VLOOKUP(Hoja1!AA23,Hoja1!$G$137:$K$211,4,0)&\")\")","v":""}]
[null,null,null,null,null,"<- Categoria a introduir per la cerca (opcional)",null,null,null,null,{"$f":"IF(Hoja1!AB6=\"\",\"\",Hoja1!AB6)","v":""},{"$f":"IF(Hoja1!AC6=\"\",\"\",Hoja1!AC6)","v":""},{"$f":"IF(Hoja1!AD6=\"\",\"\",Hoja1!AD6)","v":""},{"$f":"IF(Hoja1!AE6=\"\",\"\",Hoja1!AE6)","v":""},{"$f":"IF(Hoja1!AF6=\"\",\"\",Hoja1!AF6)","v":""},{"$f":"IF(Hoja1!AG6=\"\",\"\",Hoja1!AG6)","v":""},null,null,null,null,null,null,null,null,null,null,{"$f":"IF(Hoja1!AA24>Hoja1!$G$135,\"\",VLOOKUP(Hoja1!AA24,Hoja1!$G$137:$K$211,5,0)&\" (\"&VLOOKUP(Hoja1!AA24,Hoja1!$G$137:$K$211,4,0)&\")\")","v":""}]
[null,null,null,null,null,null,null,null,null,null,{"$f":"IF(Hoja1!AB7=\"\",\"\",Hoja1!AB7)","v":""},{"$f":"IF(Hoja1!AC7=\"\",\"\",Hoja1!AC7)","v":""},{"$f":"IF(Hoja1!AD7=\"\",\"\",Hoja1!AD7)","v":""},{"$f":"IF(Hoja1!AE7=\"\",\"\",Hoja1!AE7)","v":""},{"$f":"IF(Hoja1!AF7=\"\",\"\",Hoja1!AF7)","v":""},{"$f":"IF(Hoja1!AG7=\"\",\"\",Hoja1!AG7)","v":""},null,null,null,null,null,null,null,null,null,null,{"$f":"IF(Hoja1!AA25>Hoja1!$G$135,\"\",VLOOKUP(Hoja1!AA25,Hoja1!$G$137:$K$211,5,0)&\" (\"&VLOOKUP(Hoja1!AA25,Hoja1!$G$137:$K$211,4,0)&\")\")","v":""}]
[null,null,null,null,null,null,null,null,null,null,{"$f":"IF(Hoja1!AB8=\"\",\"\",Hoja1!AB8)","v":""},{"$f":"IF(Hoja1!AC8=\"\",\"\",Hoja1!AC8)","v":""},{"$f":"IF(Hoja1!AD8=\"\",\"\",Hoja1!AD8)","v":""},{"$f":"IF(Hoja1!AE8=\"\",\"\",Hoja1!AE8)","v":""},{"$f":"IF(Hoja1!AF8=\"\",\"\",Hoja1!AF8)","v":""},{"$f":"IF(Hoja1!AG8=\"\",\"\",Hoja1!AG8)","v":""},null,null,null,null,null,null,null,null,null,null,{"$f":"IF(Hoja1!AA26>Hoja1!$G$135,\"\",VLOOKUP(Hoja1!AA26,Hoja1!$G$137:$K$211,5,0)&\" (\"&VLOOKUP(Hoja1!AA26,Hoja1!$G$137:$K$211,4,0)&\")\")","v":""}]
[null,null,null,null,null,null,null,null,null,null,{"$f":"IF(Hoja1!AB9=\"\",\"\",Hoja1!AB9)","v":""},{"$f":"IF(Hoja1!AC9=\"\",\"\",Hoja1!AC9)","v":""},{"$f":"IF(Hoja1!AD9=\"\",\"\",Hoja1!AD9)","v":""},{"$f":"IF(Hoja1!AE9=\"\",\"\",Hoja1!AE9)","v":""},{"$f":"IF(Hoja1!AF9=\"\",\"\",Hoja1!AF9)","v":""},{"$f":"IF(Hoja1!AG9=\"\",\"\",Hoja1!AG9)","v":""},null,null,null,null,null,null,null,null,null,null,{"$f":"IF(Hoja1!AA27>Hoja1!$G$135,\"\",VLOOKUP(Hoja1!AA27,Hoja1!$G$137:$K$211,5,0)&\" (\"&VLOOKUP(Hoja1!AA27,Hoja1!$G$137:$K$211,4,0)&\")\")","v":""}]
[null,"Inscripció equip 1",null,null,null,{"$f":"IF(AND(D47=\"\",COUNTBLANK(B51:B55)=5),\"INSCRIPCIÓ EN BLANC\",IF(COUNTBLANK(I51:I55)+COUNTIF(I51:I55,\"Correcte\")<5,\"INSCRIPCIÓ ERRÒNIA\",IF(AND(D47<>\"\",COUNTBLANK(B51:B55)<4),\"INSCRIPCIÓ COMPLETA\",\"INSCRIPCIÓ INCOMPLETA\")))","v":"INSCRIPCIÓ EN BLANC"},null,null,null,null,{"$f":"IF(Hoja1!AB10=\"\",\"\",Hoja1!AB10)","v":""},{"$f":"IF(Hoja1!AC10=\"\",\"\",Hoja1!AC10)","v":""},{"$f":"IF(Hoja1!AD10=\"\",\"\",Hoja1!AD10)","v":""},{"$f":"IF(Hoja1!AE10=\"\",\"\",Hoja1!AE10)","v":""},{"$f":"IF(Hoja1!AF10=\"\",\"\",Hoja1!AF10)","v":""},{"$f":"IF(Hoja1!AG10=\"\",\"\",Hoja1!AG10)","v":""},null,null,null,null,null,null,null,null,null,null,{"$f":"IF(Hoja1!AA28>Hoja1!$G$135,\"\",VLOOKUP(Hoja1!AA28,Hoja1!$G$137:$K$211,5,0)&\" (\"&VLOOKUP(Hoja1!AA28,Hoja1!$G$137:$K$211,4,0)&\")\")","v":""}]
[null,null,null,null,null,null,null,null,null,null,{"$f":"IF(Hoja1!AB11=\"\",\"\",Hoja1!AB11)","v":""},{"$f":"IF(Hoja1!AC11=\"\",\"\",Hoja1!AC11)","v":""},{"$f":"IF(Hoja1!AD11=\"\",\"\",Hoja1!AD11)","v":""},{"$f":"IF(Hoja1!AE11=\"\",\"\",Hoja1!AE11)","v":""},{"$f":"IF(Hoja1!AF11=\"\",\"\",Hoja1!AF11)","v":""},{"$f":"IF(Hoja1!AG11=\"\",\"\",Hoja1!AG11)","v":""},null,null,null,null,null,null,null,null,null,null,{"$f":"IF(Hoja1!AA29>Hoja1!$G$135,\"\",VLOOKUP(Hoja1!AA29,Hoja1!$G$137:$K$211,5,0)&\" (\"&VLOOKUP(Hoja1!AA29,Hoja1!$G$137:$K$211,4,0)&\")\")","v":""}]
[null,"Nom per defecte:",null,{"$f":"IF($B$35=\"\",\"\",$B$35&INDEX(Hoja1!$L$72:$L$86,VALUE(RIGHT(B43))))","v":""},null,null,null,null,null,null,{"$f":"IF(Hoja1!AB12=\"\",\"\",Hoja1!AB12)","v":""},{"$f":"IF(Hoja1!AC12=\"\",\"\",Hoja1!AC12)","v":""},{"$f":"IF(Hoja1!AD12=\"\",\"\",Hoja1!AD12)","v":""},{"$f":"IF(Hoja1!AE12=\"\",\"\",Hoja1!AE12)","v":""},{"$f":"IF(Hoja1!AF12=\"\",\"\",Hoja1!AF12)","v":""},{"$f":"IF(Hoja1!AG12=\"\",\"\",Hoja1!AG12)","v":""},null,null,null,null,null,null,null,null,null,null,{"$f":"IF(Hoja1!AA30>Hoja1!$G$135,\"\",VLOOKUP(Hoja1!AA30,Hoja1!$G$137:$K$211,5,0)&\" (\"&VLOOKUP(Hoja1!AA30,Hoja1!$G$137:$K$211,4,0)&\")\")","v":""}]
[null,"Nom modificat (opcional):",null,null,null,null,null,null,null,null,{"$f":"IF(Hoja1!AB13=\"\",\"\",Hoja1!AB13)","v":""},{"$f":"IF(Hoja1!AC13=\"\",\"\",Hoja1!AC13)","v":""},{"$f":"IF(Hoja1!AD13=\"\",\"\",Hoja1!AD13)","v":""},{"$f":"IF(Hoja1!AE13=\"\",\"\",Hoja1!AE13)","v":""},{"$f":"IF(Hoja1!AF13=\"\",\"\",Hoja1!AF13)","v":""},{"$f":"IF(Hoja1!AG13=\"\",\"\",Hoja1!AG13)","v":""},null,null,null,null,null,null,null,null,null,null,{"$f":"IF(Hoja1!AA31>Hoja1!$G$135,\"\",VLOOKUP(Hoja1!AA31,Hoja1!$G$137:$K$211,5,0)&\" (\"&VLOOKUP(Hoja1!AA31,Hoja1!$G$137:$K$211,4,0)&\")\")","v":""}]
[null,"Categoria:",null,null,null,null,null,null,null,null,{"$f":"IF(Hoja1!AB14=\"\",\"\",Hoja1!AB14)","v":""},{"$f":"IF(Hoja1!AC14=\"\",\"\",Hoja1!AC14)","v":""},{"$f":"IF(Hoja1!AD14=\"\",\"\",Hoja1!AD14)","v":""},{"$f":"IF(Hoja1!AE14=\"\",\"\",Hoja1!AE14)","v":""},{"$f":"IF(Hoja1!AF14=\"\",\"\",Hoja1!AF14)","v":""},{"$f":"IF(Hoja1!AG14=\"\",\"\",Hoja1!AG14)","v":""},null,null,null,null,null,null,null,null,null,null,{"$f":"IF(Hoja1!AA32>Hoja1!$G$135,\"\",VLOOKUP(Hoja1!AA32,Hoja1!$G$137:$K$211,5,0)&\" (\"&VLOOKUP(Hoja1!AA32,Hoja1!$G$137:$K$211,4,0)&\")\")","v":""}]
[null,"Rànquing:",null,{"$f":"IF(COUNTBLANK(H51:H55)=5,\"\",MAX(H51:H55)+IF(COUNTBLANK(H51:H55)=4,0,LARGE(H51:H55,2)))","v":""},null,null,null,null,null,null,{"$f":"IF(Hoja1!AB15=\"\",\"\",Hoja1!AB15)","v":""},{"$f":"IF(Hoja1!AC15=\"\",\"\",Hoja1!AC15)","v":""},{"$f":"IF(Hoja1!AD15=\"\",\"\",Hoja1!AD15)","v":""},{"$f":"IF(Hoja1!AE15=\"\",\"\",Hoja1!AE15)","v":""},{"$f":"IF(Hoja1!AF15=\"\",\"\",Hoja1!AF15)","v":""},{"$f":"IF(Hoja1!AG15=\"\",\"\",Hoja1!AG15)","v":""}]
[null,null,null,null,null,null,null,null,null,null,{"$f":"IF(Hoja1!AB16=\"\",\"\",Hoja1!AB16)","v":""},{"$f":"IF(Hoja1!AC16=\"\",\"\",Hoja1!AC16)","v":""},{"$f":"IF(Hoja1!AD16=\"\",\"\",Hoja1!AD16)","v":""},{"$f":"IF(Hoja1!AE16=\"\",\"\",Hoja1!AE16)","v":""},{"$f":"IF(Hoja1!AF16=\"\",\"\",Hoja1!AF16)","v":""},{"$f":"IF(Hoja1!AG16=\"\",\"\",Hoja1!AG16)","v":""}]
[null,"NP","JUGADOR/A",null,"EDAT","CLUB","SEXE","rk tot","Error?",null,{"$f":"IF(Hoja1!AB17=\"\",\"\",Hoja1!AB17)","v":""},{"$f":"IF(Hoja1!AC17=\"\",\"\",Hoja1!AC17)","v":""},{"$f":"IF(Hoja1!AD17=\"\",\"\",Hoja1!AD17)","v":""},{"$f":"IF(Hoja1!AE17=\"\",\"\",Hoja1!AE17)","v":""},{"$f":"IF(Hoja1!AF17=\"\",\"\",Hoja1!AF17)","v":""},{"$f":"IF(Hoja1!AG17=\"\",\"\",Hoja1!AG17)","v":""}]
[null,null,{"$f":"IF(COUNTIF(Hoja1!A:A,B51)=1,VLOOKUP(B51,Hoja1!A:F,2,0),\"\")","v":""},null,{"$f":"IF(COUNTIF(Hoja1!A:A,B51)=1,VLOOKUP(B51,Hoja1!A:F,3,0),\"\")","v":""},{"$f":"IF(COUNTIF(Hoja1!A:A,B51)=1,VLOOKUP(B51,Hoja1!A:F,4,0),\"\")","v":""},{"$f":"IF(COUNTIF(Hoja1!A:A,B51)=1,VLOOKUP(B51,Hoja1!A:F,5,0),\"\")","v":""},{"$f":"IF(COUNTIF(Hoja1!A:A,B51)=1,VLOOKUP(B51,Hoja1!A:F,6,0),\"\")","v":""},{"$f":"IF(B51=\"\",\"\",IF(COUNTIF(Hoja1!A:A,B51)=0,\"NP erroni\",IF(COUNTIF(B:B,B51)>1,\"Inscrit/a a + d'1 equip\",IF(VLOOKUP($D$47,Hoja1!$K$53:$L$58,2,0)=0,IF(G51=\"F\",\"Correcte\",\"Error sexe\"),IF(VLOOKUP($D$47,Hoja1!$K$53:$L$58,2,0)<VLOOKUP(E51,Hoja1!$K$60:$L$70,2,0),\"Error edat\",\"Correcte\")))))","v":""},null,{"$f":"IF(Hoja1!AB18=\"\",\"\",Hoja1!AB18)","v":""},{"$f":"IF(Hoja1!AC18=\"\",\"\",Hoja1!AC18)","v":""},{"$f":"IF(Hoja1!AD18=\"\",\"\",Hoja1!AD18)","v":""},{"$f":"IF(Hoja1!AE18=\"\",\"\",Hoja1!AE18)","v":""},{"$f":"IF(Hoja1!AF18=\"\",\"\",Hoja1!AF18)","v":""},{"$f":"IF(Hoja1!AG18=\"\",\"\",Hoja1!AG18)","v":""}]
[null,null,{"$f":"IF(COUNTIF(Hoja1!A:A,B52)=1,VLOOKUP(B52,Hoja1!A:F,2,0),\"\")","v":""},null,{"$f":"IF(COUNTIF(Hoja1!A:A,B52)=1,VLOOKUP(B52,Hoja1!A:F,3,0),\"\")","v":""},{"$f":"IF(COUNTIF(Hoja1!A:A,B52)=1,VLOOKUP(B52,Hoja1!A:F,4,0),\"\")","v":""},{"$f":"IF(COUNTIF(Hoja1!A:A,B52)=1,VLOOKUP(B52,Hoja1!A:F,5,0),\"\")","v":""},{"$f":"IF(COUNTIF(Hoja1!A:A,B52)=1,VLOOKUP(B52,Hoja1!A:F,6,0),\"\")","v":""},{"$f":"IF(B52=\"\",\"\",IF(COUNTIF(Hoja1!A:A,B52)=0,\"NP erroni\",IF(COUNTIF(B:B,B52)>1,\"Inscrit/a a + d'1 equip\",IF(VLOOKUP($D$47,Hoja1!$K$53:$L$58,2,0)=0,IF(G52=\"F\",\"Correcte\",\"Error sexe\"),IF(VLOOKUP($D$47,Hoja1!$K$53:$L$58,2,0)<VLOOKUP(E52,Hoja1!$K$60:$L$70,2,0),\"Error edat\",\"Correcte\")))))","v":""},null,{"$f":"IF(Hoja1!AB19=\"\",\"\",Hoja1!AB19)","v":""},{"$f":"IF(Hoja1!AC19=\"\",\"\",Hoja1!AC19)","v":""},{"$f":"IF(Hoja1!AD19=\"\",\"\",Hoja1!AD19)","v":""},{"$f":"IF(Hoja1!AE19=\"\",\"\",Hoja1!AE19)","v":""},{"$f":"IF(Hoja1!AF19=\"\",\"\",Hoja1!AF19)","v":""},{"$f":"IF(Hoja1!AG19=\"\",\"\",Hoja1!AG19)","v":""}]
[null,null,{"$f":"IF(COUNTIF(Hoja1!A:A,B53)=1,VLOOKUP(B53,Hoja1!A:F,2,0),\"\")","v":""},null,{"$f":"IF(COUNTIF(Hoja1!A:A,B53)=1,VLOOKUP(B53,Hoja1!A:F,3,0),\"\")","v":""},{"$f":"IF(COUNTIF(Hoja1!A:A,B53)=1,VLOOKUP(B53,Hoja1!A:F,4,0),\"\")","v":""},{"$f":"IF(COUNTIF(Hoja1!A:A,B53)=1,VLOOKUP(B53,Hoja1!A:F,5,0),\"\")","v":""},{"$f":"IF(COUNTIF(Hoja1!A:A,B53)=1,VLOOKUP(B53,Hoja1!A:F,6,0),\"\")","v":""},{"$f":"IF(B53=\"\",\"\",IF(COUNTIF(Hoja1!A:A,B53)=0,\"NP erroni\",IF(COUNTIF(B:B,B53)>1,\"Inscrit/a a + d'1 equip\",IF(VLOOKUP($D$47,Hoja1!$K$53:$L$58,2,0)=0,IF(G53=\"F\",\"Correcte\",\"Error sexe\"),IF(VLOOKUP($D$47,Hoja1!$K$53:$L$58,2,0)<VLOOKUP(E53,Hoja1!$K$60:$L$70,2,0),\"Error edat\",\"Correcte\")))))","v":""},null,{"$f":"IF(Hoja1!AB20=\"\",\"\",Hoja1!AB20)","v":""},{"$f":"IF(Hoja1!AC20=\"\",\"\",Hoja1!AC20)","v":""},{"$f":"IF(Hoja1!AD20=\"\",\"\",Hoja1!AD20)","v":""},{"$f":"IF(Hoja1!AE20=\"\",\"\",Hoja1!AE20)","v":""},{"$f":"IF(Hoja1!AF20=\"\",\"\",Hoja1!AF20)","v":""},{"$f":"IF(Hoja1!AG20=\"\",\"\",Hoja1!AG20)","v":""}]
[null,null,{"$f":"IF(COUNTIF(Hoja1!A:A,B54)=1,VLOOKUP(B54,Hoja1!A:F,2,0),\"\")","v":""},null,{"$f":"IF(COUNTIF(Hoja1!A:A,B54)=1,VLOOKUP(B54,Hoja1!A:F,3,0),\"\")","v":""},{"$f":"IF(COUNTIF(Hoja1!A:A,B54)=1,VLOOKUP(B54,Hoja1!A:F,4,0),\"\")","v":""},{"$f":"IF(COUNTIF(Hoja1!A:A,B54)=1,VLOOKUP(B54,Hoja1!A:F,5,0),\"\")","v":""},{"$f":"IF(COUNTIF(Hoja1!A:A,B54)=1,VLOOKUP(B54,Hoja1!A:F,6,0),\"\")","v":""},{"$f":"IF(B54=\"\",\"\",IF(COUNTIF(Hoja1!A:A,B54)=0,\"NP erroni\",IF(COUNTIF(B:B,B54)>1,\"Inscrit/a a + d'1 equip\",IF(VLOOKUP($D$47,Hoja1!$K$53:$L$58,2,0)=0,IF(G54=\"F\",\"Correcte\",\"Error sexe\"),IF(VLOOKUP($D$47,Hoja1!$K$53:$L$58,2,0)<VLOOKUP(E54,Hoja1!$K$60:$L$70,2,0),\"Error edat\",\"Correcte\")))))","v":""},null,{"$f":"IF(Hoja1!AB21=\"\",\"\",Hoja1!AB21)","v":""},{"$f":"IF(Hoja1!AC21=\"\",\"\",Hoja1!AC21)","v":""},{"$f":"IF(Hoja1!AD21=\"\",\"\",Hoja1!AD21)","v":""},{"$f":"IF(Hoja1!AE21=\"\",\"\",Hoja1!AE21)","v":""},{"$f":"IF(Hoja1!AF21=\"\",\"\",Hoja1!AF21)","v":""},{"$f":"IF(Hoja1!AG21=\"\",\"\",Hoja1!AG21)","v":""}]
[null,null,{"$f":"IF(COUNTIF(Hoja1!A:A,B55)=1,VLOOKUP(B55,Hoja1!A:F,2,0),\"\")","v":""},null,{"$f":"IF(COUNTIF(Hoja1!A:A,B55)=1,VLOOKUP(B55,Hoja1!A:F,3,0),\"\")","v":""},{"$f":"IF(COUNTIF(Hoja1!A:A,B55)=1,VLOOKUP(B55,Hoja1!A:F,4,0),\"\")","v":""},{"$f":"IF(COUNTIF(Hoja1!A:A,B55)=1,VLOOKUP(B55,Hoja1!A:F,5,0),\"\")","v":""},{"$f":"IF(COUNTIF(Hoja1!A:A,B55)=1,VLOOKUP(B55,Hoja1!A:F,6,0),\"\")","v":""},{"$f":"IF(B55=\"\",\"\",IF(COUNTIF(Hoja1!A:A,B55)=0,\"NP erroni\",IF(COUNTIF(B:B,B55)>1,\"Inscrit/a a + d'1 equip\",IF(VLOOKUP($D$47,Hoja1!$K$53:$L$58,2,0)=0,IF(G55=\"F\",\"Correcte\",\"Error sexe\"),IF(VLOOKUP($D$47,Hoja1!$K$53:$L$58,2,0)<VLOOKUP(E55,Hoja1!$K$60:$L$70,2,0),\"Error edat\",\"Correcte\")))))","v":""},null,{"$f":"IF(Hoja1!AB22=\"\",\"\",Hoja1!AB22)","v":""},{"$f":"IF(Hoja1!AC22=\"\",\"\",Hoja1!AC22)","v":""},{"$f":"IF(Hoja1!AD22=\"\",\"\",Hoja1!AD22)","v":""},{"$f":"IF(Hoja1!AE22=\"\",\"\",Hoja1!AE22)","v":""},{"$f":"IF(Hoja1!AF22=\"\",\"\",Hoja1!AF22)","v":""},{"$f":"IF(Hoja1!AG22=\"\",\"\",Hoja1!AG22)","v":""}]
[null,null,null,null,null,null,null,null,null,null,{"$f":"IF(Hoja1!AB23=\"\",\"\",Hoja1!AB23)","v":""},{"$f":"IF(Hoja1!AC23=\"\",\"\",Hoja1!AC23)","v":""},{"$f":"IF(Hoja1!AD23=\"\",\"\",Hoja1!AD23)","v":""},{"$f":"IF(Hoja1!AE23=\"\",\"\",Hoja1!AE23)","v":""},{"$f":"IF(Hoja1!AF23=\"\",\"\",Hoja1!AF23)","v":""},{"$f":"IF(Hoja1!AG23=\"\",\"\",Hoja1!AG23)","v":""}]
[null,null,null,null,null,null,null,null,null,null,{"$f":"IF(Hoja1!AB24=\"\",\"\",Hoja1!AB24)","v":""},{"$f":"IF(Hoja1!AC24=\"\",\"\",Hoja1!AC24)","v":""},{"$f":"IF(Hoja1!AD24=\"\",\"\",Hoja1!AD24)","v":""},{"$f":"IF(Hoja1!AE24=\"\",\"\",Hoja1!AE24)","v":""},{"$f":"IF(Hoja1!AF24=\"\",\"\",Hoja1!AF24)","v":""},{"$f":"IF(Hoja1!AG24=\"\",\"\",Hoja1!AG24)","v":""}]
[null,"Inscripció equip 2",null,null,null,{"$f":"IF(AND(D62=\"\",COUNTBLANK(B66:B70)=5),\"INSCRIPCIÓ EN BLANC\",IF(COUNTBLANK(I66:I70)+COUNTIF(I66:I70,\"Correcte\")<5,\"INSCRIPCIÓ ERRÒNIA\",IF(AND(D62<>\"\",COUNTBLANK(B66:B70)<4),\"INSCRIPCIÓ COMPLETA\",\"INSCRIPCIÓ INCOMPLETA\")))","v":"INSCRIPCIÓ EN BLANC"},null,null,null,null,{"$f":"IF(Hoja1!AB25=\"\",\"\",Hoja1!AB25)","v":""},{"$f":"IF(Hoja1!AC25=\"\",\"\",Hoja1!AC25)","v":""},{"$f":"IF(Hoja1!AD25=\"\",\"\",Hoja1!AD25)","v":""},{"$f":"IF(Hoja1!AE25=\"\",\"\",Hoja1!AE25)","v":""},{"$f":"IF(Hoja1!AF25=\"\",\"\",Hoja1!AF25)","v":""},{"$f":"IF(Hoja1!AG25=\"\",\"\",Hoja1!AG25)","v":""}]
[null,null,null,null,null,null,null,null,null,null,{"$f":"IF(Hoja1!AB26=\"\",\"\",Hoja1!AB26)","v":""},{"$f":"IF(Hoja1!AC26=\"\",\"\",Hoja1!AC26)","v":""},{"$f":"IF(Hoja1!AD26=\"\",\"\",Hoja1!AD26)","v":""},{"$f":"IF(Hoja1!AE26=\"\",\"\",Hoja1!AE26)","v":""},{"$f":"IF(Hoja1!AF26=\"\",\"\",Hoja1!AF26)","v":""},{"$f":"IF(Hoja1!AG26=\"\",\"\",Hoja1!AG26)","v":""}]
[null,"Nom per defecte:",null,{"$f":"IF($B$35=\"\",\"\",$B$35&INDEX(Hoja1!$L$72:$L$86,VALUE(RIGHT(B58))))","v":""},null,null,null,null,null,null,{"$f":"IF(Hoja1!AB27=\"\",\"\",Hoja1!AB27)","v":""},{"$f":"IF(Hoja1!AC27=\"\",\"\",Hoja1!AC27)","v":""},{"$f":"IF(Hoja1!AD27=\"\",\"\",Hoja1!AD27)","v":""},{"$f":"IF(Hoja1!AE27=\"\",\"\",Hoja1!AE27)","v":""},{"$f":"IF(Hoja1!AF27=\"\",\"\",Hoja1!AF27)","v":""},{"$f":"IF(Hoja1!AG27=\"\",\"\",Hoja1!AG27)","v":""}]
[null,"Nom modificat (opcional):",null,null,null,null,null,null,null,null,{"$f":"IF(Hoja1!AB28=\"\",\"\",Hoja1!AB28)","v":""},{"$f":"IF(Hoja1!AC28=\"\",\"\",Hoja1!AC28)","v":""},{"$f":"IF(Hoja1!AD28=\"\",\"\",Hoja1!AD28)","v":""},{"$f":"IF(Hoja1!AE28=\"\",\"\",Hoja1!AE28)","v":""},{"$f":"IF(Hoja1!AF28=\"\",\"\",Hoja1!AF28)","v":""},{"$f":"IF(Hoja1!AG28=\"\",\"\",Hoja1!AG28)","v":""}]
[null,"Categoria:",null,null,null,null,null,null,null,null,{"$f":"IF(Hoja1!AB29=\"\",\"\",Hoja1!AB29)","v":""},{"$f":"IF(Hoja1!AC29=\"\",\"\",Hoja1!AC29)","v":""},{"$f":"IF(Hoja1!AD29=\"\",\"\",Hoja1!AD29)","v":""},{"$f":"IF(Hoja1!AE29=\"\",\"\",Hoja1!AE29)","v":""},{"$f":"IF(Hoja1!AF29=\"\",\"\",Hoja1!AF29)","v":""},{"$f":"IF(Hoja1!AG29=\"\",\"\",Hoja1!AG29)","v":""}]
[null,"Rànquing:",null,{"$f":"IF(COUNTBLANK(H66:H70)=5,\"\",MAX(H66:H70)+IF(COUNTBLANK(H66:H70)=4,0,LARGE(H66:H70,2)))","v":""},null,null,null,null,null,null,{"$f":"IF(Hoja1!AB30=\"\",\"\",Hoja1!AB30)","v":""},{"$f":"IF(Hoja1!AC30=\"\",\"\",Hoja1!AC30)","v":""},{"$f":"IF(Hoja1!AD30=\"\",\"\",Hoja1!AD30)","v":""},{"$f":"IF(Hoja1!AE30=\"\",\"\",Hoja1!AE30)","v":""},{"$f":"IF(Hoja1!AF30=\"\",\"\",Hoja1!AF30)","v":""},{"$f":"IF(Hoja1!AG30=\"\",\"\",Hoja1!AG30)","v":""}]
[null,null,null,null,null,null,null,null,null,null,{"$f":"IF(Hoja1!AB31=\"\",\"\",Hoja1!AB31)","v":""},{"$f":"IF(Hoja1!AC31=\"\",\"\",Hoja1!AC31)","v":""},{"$f":"IF(Hoja1!AD31=\"\",\"\",Hoja1!AD31)","v":""},{"$f":"IF(Hoja1!AE31=\"\",\"\",Hoja1!AE31)","v":""},{"$f":"IF(Hoja1!AF31=\"\",\"\",Hoja1!AF31)","v":""},{"$f":"IF(Hoja1!AG31=\"\",\"\",Hoja1!AG31)","v":""}]
[null,"NP","JUGADOR/A",null,"EDAT","CLUB","SEXE","rk tot","Error?",null,{"$f":"IF(Hoja1!AB32=\"\",\"\",Hoja1!AB32)","v":""},{"$f":"IF(Hoja1!AC32=\"\",\"\",Hoja1!AC32)","v":""},{"$f":"IF(Hoja1!AD32=\"\",\"\",Hoja1!AD32)","v":""},{"$f":"IF(Hoja1!AE32=\"\",\"\",Hoja1!AE32)","v":""},{"$f":"IF(Hoja1!AF32=\"\",\"\",Hoja1!AF32)","v":""},{"$f":"IF(Hoja1!AG32=\"\",\"\",Hoja1!AG32)","v":""}]
[null,null,{"$f":"IF(COUNTIF(Hoja1!A:A,B66)=1,VLOOKUP(B66,Hoja1!A:F,2,0),\"\")","v":""},null,{"$f":"IF(COUNTIF(Hoja1!A:A,B66)=1,VLOOKUP(B66,Hoja1!A:F,3,0),\"\")","v":""},{"$f":"IF(COUNTIF(Hoja1!A:A,B66)=1,VLOOKUP(B66,Hoja1!A:F,4,0),\"\")","v":""},{"$f":"IF(COUNTIF(Hoja1!A:A,B66)=1,VLOOKUP(B66,Hoja1!A:F,5,0),\"\")","v":""},{"$f":"IF(COUNTIF(Hoja1!A:A,B66)=1,VLOOKUP(B66,Hoja1!A:F,6,0),\"\")","v":""},{"$f":"IF(B66=\"\",\"\",IF(COUNTIF(Hoja1!A:A,B66)=0,\"NP erroni\",IF(COUNTIF(B:B,B66)>1,\"Inscrit/a a + d'1 equip\",IF(VLOOKUP($D$62,Hoja1!$K$53:$L$58,2,0)=0,IF(G66=\"F\",\"Correcte\",\"Error sexe\"),IF(VLOOKUP($D$62,Hoja1!$K$53:$L$58,2,0)<VLOOKUP(E66,Hoja1!$K$60:$L$70,2,0),\"Error edat\",\"Correcte\")))))","v":""},null,{"$f":"IF(Hoja1!AB33=\"\",\"\",Hoja1!AB33)","v":""},{"$f":"IF(Hoja1!AC33=\"\",\"\",Hoja1!AC33)","v":""},{"$f":"IF(Hoja1!AD33=\"\",\"\",Hoja1!AD33)","v":""},{"$f":"IF(Hoja1!AE33=\"\",\"\",Hoja1!AE33)","v":""},{"$f":"IF(Hoja1!AF33=\"\",\"\",Hoja1!AF33)","v":""},{"$f":"IF(Hoja1!AG33=\"\",\"\",Hoja1!AG33)","v":""}]
[null,null,{"$f":"IF(COUNTIF(Hoja1!A:A,B67)=1,VLOOKUP(B67,Hoja1!A:F,2,0),\"\")","v":""},null,{"$f":"IF(COUNTIF(Hoja1!A:A,B67)=1,VLOOKUP(B67,Hoja1!A:F,3,0),\"\")","v":""},{"$f":"IF(COUNTIF(Hoja1!A:A,B67)=1,VLOOKUP(B67,Hoja1!A:F,4,0),\"\")","v":""},{"$f":"IF(COUNTIF(Hoja1!A:A,B67)=1,VLOOKUP(B67,Hoja1!A:F,5,0),\"\")","v":""},{"$f":"IF(COUNTIF(Hoja1!A:A,B67)=1,VLOOKUP(B67,Hoja1!A:F,6,0),\"\")","v":""},{"$f":"IF(B67=\"\",\"\",IF(COUNTIF(Hoja1!A:A,B67)=0,\"NP erroni\",IF(COUNTIF(B:B,B67)>1,\"Inscrit/a a + d'1 equip\",IF(VLOOKUP($D$62,Hoja1!$K$53:$L$58,2,0)=0,IF(G67=\"F\",\"Correcte\",\"Error sexe\"),IF(VLOOKUP($D$62,Hoja1!$K$53:$L$58,2,0)<VLOOKUP(E67,Hoja1!$K$60:$L$70,2,0),\"Error edat\",\"Correcte\")))))","v":""},null,{"$f":"IF(Hoja1!AB34=\"\",\"\",Hoja1!AB34)","v":""},{"$f":"IF(Hoja1!AC34=\"\",\"\",Hoja1!AC34)","v":""},{"$f":"IF(Hoja1!AD34=\"\",\"\",Hoja1!AD34)","v":""},{"$f":"IF(Hoja1!AE34=\"\",\"\",Hoja1!AE34)","v":""},{"$f":"IF(Hoja1!AF34=\"\",\"\",Hoja1!AF34)","v":""},{"$f":"IF(Hoja1!AG34=\"\",\"\",Hoja1!AG34)","v":""}]
[null,null,{"$f":"IF(COUNTIF(Hoja1!A:A,B68)=1,VLOOKUP(B68,Hoja1!A:F,2,0),\"\")","v":""},null,{"$f":"IF(COUNTIF(Hoja1!A:A,B68)=1,VLOOKUP(B68,Hoja1!A:F,3,0),\"\")","v":""},{"$f":"IF(COUNTIF(Hoja1!A:A,B68)=1,VLOOKUP(B68,Hoja1!A:F,4,0),\"\")","v":""},{"$f":"IF(COUNTIF(Hoja1!A:A,B68)=1,VLOOKUP(B68,Hoja1!A:F,5,0),\"\")","v":""},{"$f":"IF(COUNTIF(Hoja1!A:A,B68)=1,VLOOKUP(B68,Hoja1!A:F,6,0),\"\")","v":""},{"$f":"IF(B68=\"\",\"\",IF(COUNTIF(Hoja1!A:A,B68)=0,\"NP erroni\",IF(COUNTIF(B:B,B68)>1,\"Inscrit/a a + d'1 equip\",IF(VLOOKUP($D$62,Hoja1!$K$53:$L$58,2,0)=0,IF(G68=\"F\",\"Correcte\",\"Error sexe\"),IF(VLOOKUP($D$62,Hoja1!$K$53:$L$58,2,0)<VLOOKUP(E68,Hoja1!$K$60:$L$70,2,0),\"Error edat\",\"Correcte\")))))","v":""},null,{"$f":"IF(Hoja1!AB35=\"\",\"\",Hoja1!AB35)","v":""},{"$f":"IF(Hoja1!AC35=\"\",\"\",Hoja1!AC35)","v":""},{"$f":"IF(Hoja1!AD35=\"\",\"\",Hoja1!AD35)","v":""},{"$f":"IF(Hoja1!AE35=\"\",\"\",Hoja1!AE35)","v":""},{"$f":"IF(Hoja1!AF35=\"\",\"\",Hoja1!AF35)","v":""},{"$f":"IF(Hoja1!AG35=\"\",\"\",Hoja1!AG35)","v":""}]
[null,null,{"$f":"IF(COUNTIF(Hoja1!A:A,B69)=1,VLOOKUP(B69,Hoja1!A:F,2,0),\"\")","v":""},null,{"$f":"IF(COUNTIF(Hoja1!A:A,B69)=1,VLOOKUP(B69,Hoja1!A:F,3,0),\"\")","v":""},{"$f":"IF(COUNTIF(Hoja1!A:A,B69)=1,VLOOKUP(B69,Hoja1!A:F,4,0),\"\")","v":""},{"$f":"IF(COUNTIF(Hoja1!A:A,B69)=1,VLOOKUP(B69,Hoja1!A:F,5,0),\"\")","v":""},{"$f":"IF(COUNTIF(Hoja1!A:A,B69)=1,VLOOKUP(B69,Hoja1!A:F,6,0),\"\")","v":""},{"$f":"IF(B69=\"\",\"\",IF(COUNTIF(Hoja1!A:A,B69)=0,\"NP erroni\",IF(COUNTIF(B:B,B69)>1,\"Inscrit/a a + d'1 equip\",IF(VLOOKUP($D$62,Hoja1!$K$53:$L$58,2,0)=0,IF(G69=\"F\",\"Correcte\",\"Error sexe\"),IF(VLOOKUP($D$62,Hoja1!$K$53:$L$58,2,0)<VLOOKUP(E69,Hoja1!$K$60:$L$70,2,0),\"Error edat\",\"Correcte\")))))","v":""},null,{"$f":"IF(Hoja1!AB36=\"\",\"\",Hoja1!AB36)","v":""},{"$f":"IF(Hoja1!AC36=\"\",\"\",Hoja1!AC36)","v":""},{"$f":"IF(Hoja1!AD36=\"\",\"\",Hoja1!AD36)","v":""},{"$f":"IF(Hoja1!AE36=\"\",\"\",Hoja1!AE36)","v":""},{"$f":"IF(Hoja1!AF36=\"\",\"\",Hoja1!AF36)","v":""},{"$f":"IF(Hoja1!AG36=\"\",\"\",Hoja1!AG36)","v":""}]
[null,null,{"$f":"IF(COUNTIF(Hoja1!A:A,B70)=1,VLOOKUP(B70,Hoja1!A:F,2,0),\"\")","v":""},null,{"$f":"IF(COUNTIF(Hoja1!A:A,B70)=1,VLOOKUP(B70,Hoja1!A:F,3,0),\"\")","v":""},{"$f":"IF(COUNTIF(Hoja1!A:A,B70)=1,VLOOKUP(B70,Hoja1!A:F,4,0),\"\")","v":""},{"$f":"IF(COUNTIF(Hoja1!A:A,B70)=1,VLOOKUP(B70,Hoja1!A:F,5,0),\"\")","v":""},{"$f":"IF(COUNTIF(Hoja1!A:A,B70)=1,VLOOKUP(B70,Hoja1!A:F,6,0),\"\")","v":""},{"$f":"IF(B70=\"\",\"\",IF(COUNTIF(Hoja1!A:A,B70)=0,\"NP erroni\",IF(COUNTIF(B:B,B70)>1,\"Inscrit/a a + d'1 equip\",IF(VLOOKUP($D$62,Hoja1!$K$53:$L$58,2,0)=0,IF(G70=\"F\",\"Correcte\",\"Error sexe\"),IF(VLOOKUP($D$62,Hoja1!$K$53:$L$58,2,0)<VLOOKUP(E70,Hoja1!$K$60:$L$70,2,0),\"Error edat\",\"Correcte\")))))","v":""},null,{"$f":"IF(Hoja1!AB37=\"\",\"\",Hoja1!AB37)","v":""},{"$f":"IF(Hoja1!AC37=\"\",\"\",Hoja1!AC37)","v":""},{"$f":"IF(Hoja1!AD37=\"\",\"\",Hoja1!AD37)","v":""},{"$f":"IF(Hoja1!AE37=\"\",\"\",Hoja1!AE37)","v":""},{"$f":"IF(Hoja1!AF37=\"\",\"\",Hoja1!AF37)","v":""},{"$f":"IF(Hoja1!AG37=\"\",\"\",Hoja1!AG37)","v":""}]
[null,null,null,null,null,null,null,null,null,null,{"$f":"IF(Hoja1!AB38=\"\",\"\",Hoja1!AB38)","v":""},{"$f":"IF(Hoja1!AC38=\"\",\"\",Hoja1!AC38)","v":""},{"$f":"IF(Hoja1!AD38=\"\",\"\",Hoja1!AD38)","v":""},{"$f":"IF(Hoja1!AE38=\"\",\"\",Hoja1!AE38)","v":""},{"$f":"IF(Hoja1!AF38=\"\",\"\",Hoja1!AF38)","v":""},{"$f":"IF(Hoja1!AG38=\"\",\"\",Hoja1!AG38)","v":""}]
[null,null,null,null,null,null,null,null,null,null,{"$f":"IF(Hoja1!AB39=\"\",\"\",Hoja1!AB39)","v":""},{"$f":"IF(Hoja1!AC39=\"\",\"\",Hoja1!AC39)","v":""},{"$f":"IF(Hoja1!AD39=\"\",\"\",Hoja1!AD39)","v":""},{"$f":"IF(Hoja1!AE39=\"\",\"\",Hoja1!AE39)","v":""},{"$f":"IF(Hoja1!AF39=\"\",\"\",Hoja1!AF39)","v":""},{"$f":"IF(Hoja1!AG39=\"\",\"\",Hoja1!AG39)","v":""}]
[null,"Inscripció equip 3",null,null,null,{"$f":"IF(AND(D77=\"\",COUNTBLANK(B81:B85)=5),\"INSCRIPCIÓ EN BLANC\",IF(COUNTBLANK(I81:I85)+COUNTIF(I81:I85,\"Correcte\")<5,\"INSCRIPCIÓ ERRÒNIA\",IF(AND(D77<>\"\",COUNTBLANK(B81:B85)<4),\"INSCRIPCIÓ COMPLETA\",\"INSCRIPCIÓ INCOMPLETA\")))","v":"INSCRIPCIÓ EN BLANC"},null,null,null,null,{"$f":"IF(Hoja1!AB40=\"\",\"\",Hoja1!AB40)","v":""},{"$f":"IF(Hoja1!AC40=\"\",\"\",Hoja1!AC40)","v":""},{"$f":"IF(Hoja1!AD40=\"\",\"\",Hoja1!AD40)","v":""},{"$f":"IF(Hoja1!AE40=\"\",\"\",Hoja1!AE40)","v":""},{"$f":"IF(Hoja1!AF40=\"\",\"\",Hoja1!AF40)","v":""},{"$f":"IF(Hoja1!AG40=\"\",\"\",Hoja1!AG40)","v":""}]
[null,null,null,null,null,null,null,null,null,null,{"$f":"IF(Hoja1!AB41=\"\",\"\",Hoja1!AB41)","v":""},{"$f":"IF(Hoja1!AC41=\"\",\"\",Hoja1!AC41)","v":""},{"$f":"IF(Hoja1!AD41=\"\",\"\",Hoja1!AD41)","v":""},{"$f":"IF(Hoja1!AE41=\"\",\"\",Hoja1!AE41)","v":""},{"$f":"IF(Hoja1!AF41=\"\",\"\",Hoja1!AF41)","v":""},{"$f":"IF(Hoja1!AG41=\"\",\"\",Hoja1!AG41)","v":""}]
[null,"Nom per defecte:",null,{"$f":"IF($B$35=\"\",\"\",$B$35&INDEX(Hoja1!$L$72:$L$86,VALUE(RIGHT(B73))))","v":""},null,null,null,null,null,null,{"$f":"IF(Hoja1!AB42=\"\",\"\",Hoja1!AB42)","v":""},{"$f":"IF(Hoja1!AC42=\"\",\"\",Hoja1!AC42)","v":""},{"$f":"IF(Hoja1!AD42=\"\",\"\",Hoja1!AD42)","v":""},{"$f":"IF(Hoja1!AE42=\"\",\"\",Hoja1!AE42)","v":""},{"$f":"IF(Hoja1!AF42=\"\",\"\",Hoja1!AF42)","v":""},{"$f":"IF(Hoja1!AG42=\"\",\"\",Hoja1!AG42)","v":""}]
[null,"Nom modificat (opcional):",null,null,null,null,null,null,null,null,{"$f":"IF(Hoja1!AB43=\"\",\"\",Hoja1!AB43)","v":""},{"$f":"IF(Hoja1!AC43=\"\",\"\",Hoja1!AC43)","v":""},{"$f":"IF(Hoja1!AD43=\"\",\"\",Hoja1!AD43)","v":""},{"$f":"IF(Hoja1!AE43=\"\",\"\",Hoja1!AE43)","v":""},{"$f":"IF(Hoja1!AF43=\"\",\"\",Hoja1!AF43)","v":""},{"$f":"IF(Hoja1!AG43=\"\",\"\",Hoja1!AG43)","v":""}]
[null,"Categoria:",null,null,null,null,null,null,null,null,{"$f":"IF(Hoja1!AB44=\"\",\"\",Hoja1!AB44)","v":""},{"$f":"IF(Hoja1!AC44=\"\",\"\",Hoja1!AC44)","v":""},{"$f":"IF(Hoja1!AD44=\"\",\"\",Hoja1!AD44)","v":""},{"$f":"IF(Hoja1!AE44=\"\",\"\",Hoja1!AE44)","v":""},{"$f":"IF(Hoja1!AF44=\"\",\"\",Hoja1!AF44)","v":""},{"$f":"IF(Hoja1!AG44=\"\",\"\",Hoja1!AG44)","v":""}]
[null,"Rànquing:",null,{"$f":"IF(COUNTBLANK(H81:H85)=5,\"\",MAX(H81:H85)+IF(COUNTBLANK(H81:H85)=4,0,LARGE(H81:H85,2)))","v":""},null,null,null,null,null,null,{"$f":"IF(Hoja1!AB45=\"\",\"\",Hoja1!AB45)","v":""},{"$f":"IF(Hoja1!AC45=\"\",\"\",Hoja1!AC45)","v":""},{"$f":"IF(Hoja1!AD45=\"\",\"\",Hoja1!AD45)","v":""},{"$f":"IF(Hoja1!AE45=\"\",\"\",Hoja1!AE45)","v":""},{"$f":"IF(Hoja1!AF45=\"\",\"\",Hoja1!AF45)","v":""},{"$f":"IF(Hoja1!AG45=\"\",\"\",Hoja1!AG45)","v":""}]
[null,null,null,null,null,null,null,null,null,null,{"$f":"IF(Hoja1!AB46=\"\",\"\",Hoja1!AB46)","v":""},{"$f":"IF(Hoja1!AC46=\"\",\"\",Hoja1!AC46)","v":""},{"$f":"IF(Hoja1!AD46=\"\",\"\",Hoja1!AD46)","v":""},{"$f":"IF(Hoja1!AE46=\"\",\"\",Hoja1!AE46)","v":""},{"$f":"IF(Hoja1!AF46=\"\",\"\",Hoja1!AF46)","v":""},{"$f":"IF(Hoja1!AG46=\"\",\"\",Hoja1!AG46)","v":""}]
[null,"NP","JUGADOR/A",null,"EDAT","CLUB","SEXE","rk tot","Error?",null,{"$f":"IF(Hoja1!AB47=\"\",\"\",Hoja1!AB47)","v":""},{"$f":"IF(Hoja1!AC47=\"\",\"\",Hoja1!AC47)","v":""},{"$f":"IF(Hoja1!AD47=\"\",\"\",Hoja1!AD47)","v":""},{"$f":"IF(Hoja1!AE47=\"\",\"\",Hoja1!AE47)","v":""},{"$f":"IF(Hoja1!AF47=\"\",\"\",Hoja1!AF47)","v":""},{"$f":"IF(Hoja1!AG47=\"\",\"\",Hoja1!AG47)","v":""}]
[null,null,{"$f":"IF(COUNTIF(Hoja1!A:A,B81)=1,VLOOKUP(B81,Hoja1!A:F,2,0),\"\")","v":""},null,{"$f":"IF(COUNTIF(Hoja1!A:A,B81)=1,VLOOKUP(B81,Hoja1!A:F,3,0),\"\")","v":""},{"$f":"IF(COUNTIF(Hoja1!A:A,B81)=1,VLOOKUP(B81,Hoja1!A:F,4,0),\"\")","v":""},{"$f":"IF(COUNTIF(Hoja1!A:A,B81)=1,VLOOKUP(B81,Hoja1!A:F,5,0),\"\")","v":""},{"$f":"IF(COUNTIF(Hoja1!A:A,B81)=1,VLOOKUP(B81,Hoja1!A:F,6,0),\"\")","v":""},{"$f":"IF(B81=\"\",\"\",IF(COUNTIF(Hoja1!A:A,B81)=0,\"NP erroni\",IF(COUNTIF(B:B,B81)>1,\"Inscrit/a a + d'1 equip\",IF(VLOOKUP($D$77,Hoja1!$K$53:$L$58,2,0)=0,IF(G81=\"F\",\"Correcte\",\"Error sexe\"),IF(VLOOKUP($D$77,Hoja1!$K$53:$L$58,2,0)<VLOOKUP(E81,Hoja1!$K$60:$L$70,2,0),\"Error edat\",\"Correcte\")))))","v":""},null,{"$f":"IF(Hoja1!AB48=\"\",\"\",Hoja1!AB48)","v":""},{"$f":"IF(Hoja1!AC48=\"\",\"\",Hoja1!AC48)","v":""},{"$f":"IF(Hoja1!AD48=\"\",\"\",Hoja1!AD48)","v":""},{"$f":"IF(Hoja1!AE48=\"\",\"\",Hoja1!AE48)","v":""},{"$f":"IF(Hoja1!AF48=\"\",\"\",Hoja1!AF48)","v":""},{"$f":"IF(Hoja1!AG48=\"\",\"\",Hoja1!AG48)","v":""}]
[null,null,{"$f":"IF(COUNTIF(Hoja1!A:A,B82)=1,VLOOKUP(B82,Hoja1!A:F,2,0),\"\")","v":""},null,{"$f":"IF(COUNTIF(Hoja1!A:A,B82)=1,VLOOKUP(B82,Hoja1!A:F,3,0),\"\")","v":""},{"$f":"IF(COUNTIF(Hoja1!A:A,B82)=1,VLOOKUP(B82,Hoja1!A:F,4,0),\"\")","v":""},{"$f":"IF(COUNTIF(Hoja1!A:A,B82)=1,VLOOKUP(B82,Hoja1!A:F,5,0),\"\")","v":""},{"$f":"IF(COUNTIF(Hoja1!A:A,B82)=1,VLOOKUP(B82,Hoja1!A:F,6,0),\"\")","v":""},{"$f":"IF(B82=\"\",\"\",IF(COUNTIF(Hoja1!A:A,B82)=0,\"NP erroni\",IF(COUNTIF(B:B,B82)>1,\"Inscrit/a a + d'1 equip\",IF(VLOOKUP($D$77,Hoja1!$K$53:$L$58,2,0)=0,IF(G82=\"F\",\"Correcte\",\"Error sexe\"),IF(VLOOKUP($D$77,Hoja1!$K$53:$L$58,2,0)<VLOOKUP(E82,Hoja1!$K$60:$L$70,2,0),\"Error edat\",\"Correcte\")))))","v":""},null,{"$f":"IF(Hoja1!AB49=\"\",\"\",Hoja1!AB49)","v":""},{"$f":"IF(Hoja1!AC49=\"\",\"\",Hoja1!AC49)","v":""},{"$f":"IF(Hoja1!AD49=\"\",\"\",Hoja1!AD49)","v":""},{"$f":"IF(Hoja1!AE49=\"\",\"\",Hoja1!AE49)","v":""},{"$f":"IF(Hoja1!AF49=\"\",\"\",Hoja1!AF49)","v":""},{"$f":"IF(Hoja1!AG49=\"\",\"\",Hoja1!AG49)","v":""}]
[null,null,{"$f":"IF(COUNTIF(Hoja1!A:A,B83)=1,VLOOKUP(B83,Hoja1!A:F,2,0),\"\")","v":""},null,{"$f":"IF(COUNTIF(Hoja1!A:A,B83)=1,VLOOKUP(B83,Hoja1!A:F,3,0),\"\")","v":""},{"$f":"IF(COUNTIF(Hoja1!A:A,B83)=1,VLOOKUP(B83,Hoja1!A:F,4,0),\"\")","v":""},{"$f":"IF(COUNTIF(Hoja1!A:A,B83)=1,VLOOKUP(B83,Hoja1!A:F,5,0),\"\")","v":""},{"$f":"IF(COUNTIF(Hoja1!A:A,B83)=1,VLOOKUP(B83,Hoja1!A:F,6,0),\"\")","v":""},{"$f":"IF(B83=\"\",\"\",IF(COUNTIF(Hoja1!A:A,B83)=0,\"NP erroni\",IF(COUNTIF(B:B,B83)>1,\"Inscrit/a a + d'1 equip\",IF(VLOOKUP($D$77,Hoja1!$K$53:$L$58,2,0)=0,IF(G83=\"F\",\"Correcte\",\"Error sexe\"),IF(VLOOKUP($D$77,Hoja1!$K$53:$L$58,2,0)<VLOOKUP(E83,Hoja1!$K$60:$L$70,2,0),\"Error edat\",\"Correcte\")))))","v":""},null,{"$f":"IF(Hoja1!AB50=\"\",\"\",Hoja1!AB50)","v":""},{"$f":"IF(Hoja1!AC50=\"\",\"\",Hoja1!AC50)","v":""},{"$f":"IF(Hoja1!AD50=\"\",\"\",Hoja1!AD50)","v":""},{"$f":"IF(Hoja1!AE50=\"\",\"\",Hoja1!AE50)","v":""},{"$f":"IF(Hoja1!AF50=\"\",\"\",Hoja1!AF50)","v":""},{"$f":"IF(Hoja1!AG50=\"\",\"\",Hoja1!AG50)","v":""}]
[null,null,{"$f":"IF(COUNTIF(Hoja1!A:A,B84)=1,VLOOKUP(B84,Hoja1!A:F,2,0),\"\")","v":""},null,{"$f":"IF(COUNTIF(Hoja1!A:A,B84)=1,VLOOKUP(B84,Hoja1!A:F,3,0),\"\")","v":""},{"$f":"IF(COUNTIF(Hoja1!A:A,B84)=1,VLOOKUP(B84,Hoja1!A:F,4,0),\"\")","v":""},{"$f":"IF(COUNTIF(Hoja1!A:A,B84)=1,VLOOKUP(B84,Hoja1!A:F,5,0),\"\")","v":""},{"$f":"IF(COUNTIF(Hoja1!A:A,B84)=1,VLOOKUP(B84,Hoja1!A:F,6,0),\"\")","v":""},{"$f":"IF(B84=\"\",\"\",IF(COUNTIF(Hoja1!A:A,B84)=0,\"NP erroni\",IF(COUNTIF(B:B,B84)>1,\"Inscrit/a a + d'1 equip\",IF(VLOOKUP($D$77,Hoja1!$K$53:$L$58,2,0)=0,IF(G84=\"F\",\"Correcte\",\"Error sexe\"),IF(VLOOKUP($D$77,Hoja1!$K$53:$L$58,2,0)<VLOOKUP(E84,Hoja1!$K$60:$L$70,2,0),\"Error edat\",\"Correcte\")))))","v":""},null,{"$f":"IF(Hoja1!AB51=\"\",\"\",Hoja1!AB51)","v":""},{"$f":"IF(Hoja1!AC51=\"\",\"\",Hoja1!AC51)","v":""},{"$f":"IF(Hoja1!AD51=\"\",\"\",Hoja1!AD51)","v":""},{"$f":"IF(Hoja1!AE51=\"\",\"\",Hoja1!AE51)","v":""},{"$f":"IF(Hoja1!AF51=\"\",\"\",Hoja1!AF51)","v":""},{"$f":"IF(Hoja1!AG51=\"\",\"\",Hoja1!AG51)","v":""}]
[null,null,{"$f":"IF(COUNTIF(Hoja1!A:A,B85)=1,VLOOKUP(B85,Hoja1!A:F,2,0),\"\")","v":""},null,{"$f":"IF(COUNTIF(Hoja1!A:A,B85)=1,VLOOKUP(B85,Hoja1!A:F,3,0),\"\")","v":""},{"$f":"IF(COUNTIF(Hoja1!A:A,B85)=1,VLOOKUP(B85,Hoja1!A:F,4,0),\"\")","v":""},{"$f":"IF(COUNTIF(Hoja1!A:A,B85)=1,VLOOKUP(B85,Hoja1!A:F,5,0),\"\")","v":""},{"$f":"IF(COUNTIF(Hoja1!A:A,B85)=1,VLOOKUP(B85,Hoja1!A:F,6,0),\"\")","v":""},{"$f":"IF(B85=\"\",\"\",IF(COUNTIF(Hoja1!A:A,B85)=0,\"NP erroni\",IF(COUNTIF(B:B,B85)>1,\"Inscrit/a a + d'1 equip\",IF(VLOOKUP($D$77,Hoja1!$K$53:$L$58,2,0)=0,IF(G85=\"F\",\"Correcte\",\"Error sexe\"),IF(VLOOKUP($D$77,Hoja1!$K$53:$L$58,2,0)<VLOOKUP(E85,Hoja1!$K$60:$L$70,2,0),\"Error edat\",\"Correcte\")))))","v":""},null,{"$f":"IF(Hoja1!AB52=\"\",\"\",Hoja1!AB52)","v":""},{"$f":"IF(Hoja1!AC52=\"\",\"\",Hoja1!AC52)","v":""},{"$f":"IF(Hoja1!AD52=\"\",\"\",Hoja1!AD52)","v":""},{"$f":"IF(Hoja1!AE52=\"\",\"\",Hoja1!AE52)","v":""},{"$f":"IF(Hoja1!AF52=\"\",\"\",Hoja1!AF52)","v":""},{"$f":"IF(Hoja1!AG52=\"\",\"\",Hoja1!AG52)","v":""}]
[null,null,null,null,null,null,null,null,null,null,{"$f":"IF(Hoja1!AB53=\"\",\"\",Hoja1!AB53)","v":""},{"$f":"IF(Hoja1!AC53=\"\",\"\",Hoja1!AC53)","v":""},{"$f":"IF(Hoja1!AD53=\"\",\"\",Hoja1!AD53)","v":""},{"$f":"IF(Hoja1!AE53=\"\",\"\",Hoja1!AE53)","v":""},{"$f":"IF(Hoja1!AF53=\"\",\"\",Hoja1!AF53)","v":""},{"$f":"IF(Hoja1!AG53=\"\",\"\",Hoja1!AG53)","v":""}]
[null,null,null,null,null,null,null,null,null,null,{"$f":"IF(Hoja1!AB54=\"\",\"\",Hoja1!AB54)","v":""},{"$f":"IF(Hoja1!AC54=\"\",\"\",Hoja1!AC54)","v":""},{"$f":"IF(Hoja1!AD54=\"\",\"\",Hoja1!AD54)","v":""},{"$f":"IF(Hoja1!AE54=\"\",\"\",Hoja1!AE54)","v":""},{"$f":"IF(Hoja1!AF54=\"\",\"\",Hoja1!AF54)","v":""},{"$f":"IF(Hoja1!AG54=\"\",\"\",Hoja1!AG54)","v":""}]
[null,"Inscripció equip 4",null,null,null,{"$f":"IF(AND(D92=\"\",COUNTBLANK(B96:B100)=5),\"INSCRIPCIÓ EN BLANC\",IF(COUNTBLANK(I96:I100)+COUNTIF(I96:I100,\"Correcte\")<5,\"INSCRIPCIÓ ERRÒNIA\",IF(AND(D92<>\"\",COUNTBLANK(B96:B100)<4),\"INSCRIPCIÓ COMPLETA\",\"INSCRIPCIÓ INCOMPLETA\")))","v":"INSCRIPCIÓ EN BLANC"},null,null,null,null,{"$f":"IF(Hoja1!AB55=\"\",\"\",Hoja1!AB55)","v":""},{"$f":"IF(Hoja1!AC55=\"\",\"\",Hoja1!AC55)","v":""},{"$f":"IF(Hoja1!AD55=\"\",\"\",Hoja1!AD55)","v":""},{"$f":"IF(Hoja1!AE55=\"\",\"\",Hoja1!AE55)","v":""},{"$f":"IF(Hoja1!AF55=\"\",\"\",Hoja1!AF55)","v":""},{"$f":"IF(Hoja1!AG55=\"\",\"\",Hoja1!AG55)","v":""}]
[null,null,null,null,null,null,null,null,null,null,{"$f":"IF(Hoja1!AB56=\"\",\"\",Hoja1!AB56)","v":""},{"$f":"IF(Hoja1!AC56=\"\",\"\",Hoja1!AC56)","v":""},{"$f":"IF(Hoja1!AD56=\"\",\"\",Hoja1!AD56)","v":""},{"$f":"IF(Hoja1!AE56=\"\",\"\",Hoja1!AE56)","v":""},{"$f":"IF(Hoja1!AF56=\"\",\"\",Hoja1!AF56)","v":""},{"$f":"IF(Hoja1!AG56=\"\",\"\",Hoja1!AG56)","v":""}]
[null,"Nom per defecte:",null,{"$f":"IF($B$35=\"\",\"\",$B$35&INDEX(Hoja1!$L$72:$L$86,VALUE(RIGHT(B88))))","v":""},null,null,null,null,null,null,{"$f":"IF(Hoja1!AB57=\"\",\"\",Hoja1!AB57)","v":""},{"$f":"IF(Hoja1!AC57=\"\",\"\",Hoja1!AC57)","v":""},{"$f":"IF(Hoja1!AD57=\"\",\"\",Hoja1!AD57)","v":""},{"$f":"IF(Hoja1!AE57=\"\",\"\",Hoja1!AE57)","v":""},{"$f":"IF(Hoja1!AF57=\"\",\"\",Hoja1!AF57)","v":""},{"$f":"IF(Hoja1!AG57=\"\",\"\",Hoja1!AG57)","v":""}]
[null,"Nom modificat (opcional):",null,null,null,null,null,null,null,null,{"$f":"IF(Hoja1!AB58=\"\",\"\",Hoja1!AB58)","v":""},{"$f":"IF(Hoja1!AC58=\"\",\"\",Hoja1!AC58)","v":""},{"$f":"IF(Hoja1!AD58=\"\",\"\",Hoja1!AD58)","v":""},{"$f":"IF(Hoja1!AE58=\"\",\"\",Hoja1!AE58)","v":""},{"$f":"IF(Hoja1!AF58=\"\",\"\",Hoja1!AF58)","v":""},{"$f":"IF(Hoja1!AG58=\"\",\"\",Hoja1!AG58)","v":""}]
[null,"Categoria:",null,null,null,null,null,null,null,null,{"$f":"IF(Hoja1!AB59=\"\",\"\",Hoja1!AB59)","v":""},{"$f":"IF(Hoja1!AC59=\"\",\"\",Hoja1!AC59)","v":""},{"$f":"IF(Hoja1!AD59=\"\",\"\",Hoja1!AD59)","v":""},{"$f":"IF(Hoja1!AE59=\"\",\"\",Hoja1!AE59)","v":""},{"$f":"IF(Hoja1!AF59=\"\",\"\",Hoja1!AF59)","v":""},{"$f":"IF(Hoja1!AG59=\"\",\"\",Hoja1!AG59)","v":""}]
[null,"Rànquing:",null,{"$f":"IF(COUNTBLANK(H96:H100)=5,\"\",MAX(H96:H100)+IF(COUNTBLANK(H96:H100)=4,0,LARGE(H96:H100,2)))","v":""},null,null,null,null,null,null,{"$f":"IF(Hoja1!AB60=\"\",\"\",Hoja1!AB60)","v":""},{"$f":"IF(Hoja1!AC60=\"\",\"\",Hoja1!AC60)","v":""},{"$f":"IF(Hoja1!AD60=\"\",\"\",Hoja1!AD60)","v":""},{"$f":"IF(Hoja1!AE60=\"\",\"\",Hoja1!AE60)","v":""},{"$f":"IF(Hoja1!AF60=\"\",\"\",Hoja1!AF60)","v":""},{"$f":"IF(Hoja1!AG60=\"\",\"\",Hoja1!AG60)","v":""}]
[null,null,null,null,null,null,null,null,null,null,{"$f":"IF(Hoja1!AB61=\"\",\"\",Hoja1!AB61)","v":""},{"$f":"IF(Hoja1!AC61=\"\",\"\",Hoja1!AC61)","v":""},{"$f":"IF(Hoja1!AD61=\"\",\"\",Hoja1!AD61)","v":""},{"$f":"IF(Hoja1!AE61=\"\",\"\",Hoja1!AE61)","v":""},{"$f":"IF(Hoja1!AF61=\"\",\"\",Hoja1!AF61)","v":""},{"$f":"IF(Hoja1!AG61=\"\",\"\",Hoja1!AG61)","v":""}]
[null,"NP","JUGADOR/A",null,"EDAT","CLUB","SEXE","rk tot","Error?",null,{"$f":"IF(Hoja1!AB62=\"\",\"\",Hoja1!AB62)","v":""},{"$f":"IF(Hoja1!AC62=\"\",\"\",Hoja1!AC62)","v":""},{"$f":"IF(Hoja1!AD62=\"\",\"\",Hoja1!AD62)","v":""},{"$f":"IF(Hoja1!AE62=\"\",\"\",Hoja1!AE62)","v":""},{"$f":"IF(Hoja1!AF62=\"\",\"\",Hoja1!AF62)","v":""},{"$f":"IF(Hoja1!AG62=\"\",\"\",Hoja1!AG62)","v":""}]
[null,null,{"$f":"IF(COUNTIF(Hoja1!A:A,B96)=1,VLOOKUP(B96,Hoja1!A:F,2,0),\"\")","v":""},null,{"$f":"IF(COUNTIF(Hoja1!A:A,B96)=1,VLOOKUP(B96,Hoja1!A:F,3,0),\"\")","v":""},{"$f":"IF(COUNTIF(Hoja1!A:A,B96)=1,VLOOKUP(B96,Hoja1!A:F,4,0),\"\")","v":""},{"$f":"IF(COUNTIF(Hoja1!A:A,B96)=1,VLOOKUP(B96,Hoja1!A:F,5,0),\"\")","v":""},{"$f":"IF(COUNTIF(Hoja1!A:A,B96)=1,VLOOKUP(B96,Hoja1!A:F,6,0),\"\")","v":""},{"$f":"IF(B96=\"\",\"\",IF(COUNTIF(Hoja1!A:A,B96)=0,\"NP erroni\",IF(COUNTIF(B:B,B96)>1,\"Inscrit/a a + d'1 equip\",IF(VLOOKUP($D$92,Hoja1!$K$53:$L$58,2,0)=0,IF(G96=\"F\",\"Correcte\",\"Error sexe\"),IF(VLOOKUP($D$92,Hoja1!$K$53:$L$58,2,0)<VLOOKUP(E96,Hoja1!$K$60:$L$70,2,0),\"Error edat\",\"Correcte\")))))","v":""},null,{"$f":"IF(Hoja1!AB63=\"\",\"\",Hoja1!AB63)","v":""},{"$f":"IF(Hoja1!AC63=\"\",\"\",Hoja1!AC63)","v":""},{"$f":"IF(Hoja1!AD63=\"\",\"\",Hoja1!AD63)","v":""},{"$f":"IF(Hoja1!AE63=\"\",\"\",Hoja1!AE63)","v":""},{"$f":"IF(Hoja1!AF63=\"\",\"\",Hoja1!AF63)","v":""},{"$f":"IF(Hoja1!AG63=\"\",\"\",Hoja1!AG63)","v":""}]
[null,null,{"$f":"IF(COUNTIF(Hoja1!A:A,B97)=1,VLOOKUP(B97,Hoja1!A:F,2,0),\"\")","v":""},null,{"$f":"IF(COUNTIF(Hoja1!A:A,B97)=1,VLOOKUP(B97,Hoja1!A:F,3,0),\"\")","v":""},{"$f":"IF(COUNTIF(Hoja1!A:A,B97)=1,VLOOKUP(B97,Hoja1!A:F,4,0),\"\")","v":""},{"$f":"IF(COUNTIF(Hoja1!A:A,B97)=1,VLOOKUP(B97,Hoja1!A:F,5,0),\"\")","v":""},{"$f":"IF(COUNTIF(Hoja1!A:A,B97)=1,VLOOKUP(B97,Hoja1!A:F,6,0),\"\")","v":""},{"$f":"IF(B97=\"\",\"\",IF(COUNTIF(Hoja1!A:A,B97)=0,\"NP erroni\",IF(COUNTIF(B:B,B97)>1,\"Inscrit/a a + d'1 equip\",IF(VLOOKUP($D$92,Hoja1!$K$53:$L$58,2,0)=0,IF(G97=\"F\",\"Correcte\",\"Error sexe\"),IF(VLOOKUP($D$92,Hoja1!$K$53:$L$58,2,0)<VLOOKUP(E97,Hoja1!$K$60:$L$70,2,0),\"Error edat\",\"Correcte\")))))","v":""},null,{"$f":"IF(Hoja1!AB64=\"\",\"\",Hoja1!AB64)","v":""},{"$f":"IF(Hoja1!AC64=\"\",\"\",Hoja1!AC64)","v":""},{"$f":"IF(Hoja1!AD64=\"\",\"\",Hoja1!AD64)","v":""},{"$f":"IF(Hoja1!AE64=\"\",\"\",Hoja1!AE64)","v":""},{"$f":"IF(Hoja1!AF64=\"\",\"\",Hoja1!AF64)","v":""},{"$f":"IF(Hoja1!AG64=\"\",\"\",Hoja1!AG64)","v":""}]
[null,null,{"$f":"IF(COUNTIF(Hoja1!A:A,B98)=1,VLOOKUP(B98,Hoja1!A:F,2,0),\"\")","v":""},null,{"$f":"IF(COUNTIF(Hoja1!A:A,B98)=1,VLOOKUP(B98,Hoja1!A:F,3,0),\"\")","v":""},{"$f":"IF(COUNTIF(Hoja1!A:A,B98)=1,VLOOKUP(B98,Hoja1!A:F,4,0),\"\")","v":""},{"$f":"IF(COUNTIF(Hoja1!A:A,B98)=1,VLOOKUP(B98,Hoja1!A:F,5,0),\"\")","v":""},{"$f":"IF(COUNTIF(Hoja1!A:A,B98)=1,VLOOKUP(B98,Hoja1!A:F,6,0),\"\")","v":""},{"$f":"IF(B98=\"\",\"\",IF(COUNTIF(Hoja1!A:A,B98)=0,\"NP erroni\",IF(COUNTIF(B:B,B98)>1,\"Inscrit/a a + d'1 equip\",IF(VLOOKUP($D$92,Hoja1!$K$53:$L$58,2,0)=0,IF(G98=\"F\",\"Correcte\",\"Error sexe\"),IF(VLOOKUP($D$92,Hoja1!$K$53:$L$58,2,0)<VLOOKUP(E98,Hoja1!$K$60:$L$70,2,0),\"Error edat\",\"Correcte\")))))","v":""},null,{"$f":"IF(Hoja1!AB65=\"\",\"\",Hoja1!AB65)","v":""},{"$f":"IF(Hoja1!AC65=\"\",\"\",Hoja1!AC65)","v":""},{"$f":"IF(Hoja1!AD65=\"\",\"\",Hoja1!AD65)","v":""},{"$f":"IF(Hoja1!AE65=\"\",\"\",Hoja1!AE65)","v":""},{"$f":"IF(Hoja1!AF65=\"\",\"\",Hoja1!AF65)","v":""},{"$f":"IF(Hoja1!AG65=\"\",\"\",Hoja1!AG65)","v":""}]
[null,null,{"$f":"IF(COUNTIF(Hoja1!A:A,B99)=1,VLOOKUP(B99,Hoja1!A:F,2,0),\"\")","v":""},null,{"$f":"IF(COUNTIF(Hoja1!A:A,B99)=1,VLOOKUP(B99,Hoja1!A:F,3,0),\"\")","v":""},{"$f":"IF(COUNTIF(Hoja1!A:A,B99)=1,VLOOKUP(B99,Hoja1!A:F,4,0),\"\")","v":""},{"$f":"IF(COUNTIF(Hoja1!A:A,B99)=1,VLOOKUP(B99,Hoja1!A:F,5,0),\"\")","v":""},{"$f":"IF(COUNTIF(Hoja1!A:A,B99)=1,VLOOKUP(B99,Hoja1!A:F,6,0),\"\")","v":""},{"$f":"IF(B99=\"\",\"\",IF(COUNTIF(Hoja1!A:A,B99)=0,\"NP erroni\",IF(COUNTIF(B:B,B99)>1,\"Inscrit/a a + d'1 equip\",IF(VLOOKUP($D$92,Hoja1!$K$53:$L$58,2,0)=0,IF(G99=\"F\",\"Correcte\",\"Error sexe\"),IF(VLOOKUP($D$92,Hoja1!$K$53:$L$58,2,0)<VLOOKUP(E99,Hoja1!$K$60:$L$70,2,0),\"Error edat\",\"Correcte\")))))","v":""},null,{"$f":"IF(Hoja1!AB66=\"\",\"\",Hoja1!AB66)","v":""},{"$f":"IF(Hoja1!AC66=\"\",\"\",Hoja1!AC66)","v":""},{"$f":"IF(Hoja1!AD66=\"\",\"\",Hoja1!AD66)","v":""},{"$f":"IF(Hoja1!AE66=\"\",\"\",Hoja1!AE66)","v":""},{"$f":"IF(Hoja1!AF66=\"\",\"\",Hoja1!AF66)","v":""},{"$f":"IF(Hoja1!AG66=\"\",\"\",Hoja1!AG66)","v":""}]
[null,null,{"$f":"IF(COUNTIF(Hoja1!A:A,B100)=1,VLOOKUP(B100,Hoja1!A:F,2,0),\"\")","v":""},null,{"$f":"IF(COUNTIF(Hoja1!A:A,B100)=1,VLOOKUP(B100,Hoja1!A:F,3,0),\"\")","v":""},{"$f":"IF(COUNTIF(Hoja1!A:A,B100)=1,VLOOKUP(B100,Hoja1!A:F,4,0),\"\")","v":""},{"$f":"IF(COUNTIF(Hoja1!A:A,B100)=1,VLOOKUP(B100,Hoja1!A:F,5,0),\"\")","v":""},{"$f":"IF(COUNTIF(Hoja1!A:A,B100)=1,VLOOKUP(B100,Hoja1!A:F,6,0),\"\")","v":""},{"$f":"IF(B100=\"\",\"\",IF(COUNTIF(Hoja1!A:A,B100)=0,\"NP erroni\",IF(COUNTIF(B:B,B100)>1,\"Inscrit/a a + d'1 equip\",IF(VLOOKUP($D$92,Hoja1!$K$53:$L$58,2,0)=0,IF(G100=\"F\",\"Correcte\",\"Error sexe\"),IF(VLOOKUP($D$92,Hoja1!$K$53:$L$58,2,0)<VLOOKUP(E100,Hoja1!$K$60:$L$70,2,0),\"Error edat\",\"Correcte\")))))","v":""},null,{"$f":"IF(Hoja1!AB67=\"\",\"\",Hoja1!AB67)","v":""},{"$f":"IF(Hoja1!AC67=\"\",\"\",Hoja1!AC67)","v":""},{"$f":"IF(Hoja1!AD67=\"\",\"\",Hoja1!AD67)","v":""},{"$f":"IF(Hoja1!AE67=\"\",\"\",Hoja1!AE67)","v":""},{"$f":"IF(Hoja1!AF67=\"\",\"\",Hoja1!AF67)","v":""},{"$f":"IF(Hoja1!AG67=\"\",\"\",Hoja1!AG67)","v":""}]
[null,null,null,null,null,null,null,null,null,null,{"$f":"IF(Hoja1!AB68=\"\",\"\",Hoja1!AB68)","v":""},{"$f":"IF(Hoja1!AC68=\"\",\"\",Hoja1!AC68)","v":""},{"$f":"IF(Hoja1!AD68=\"\",\"\",Hoja1!AD68)","v":""},{"$f":"IF(Hoja1!AE68=\"\",\"\",Hoja1!AE68)","v":""},{"$f":"IF(Hoja1!AF68=\"\",\"\",Hoja1!AF68)","v":""},{"$f":"IF(Hoja1!AG68=\"\",\"\",Hoja1!AG68)","v":""}]
[null,null,null,null,null,null,null,null,null,null,{"$f":"IF(Hoja1!AB69=\"\",\"\",Hoja1!AB69)","v":""},{"$f":"IF(Hoja1!AC69=\"\",\"\",Hoja1!AC69)","v":""},{"$f":"IF(Hoja1!AD69=\"\",\"\",Hoja1!AD69)","v":""},{"$f":"IF(Hoja1!AE69=\"\",\"\",Hoja1!AE69)","v":""},{"$f":"IF(Hoja1!AF69=\"\",\"\",Hoja1!AF69)","v":""},{"$f":"IF(Hoja1!AG69=\"\",\"\",Hoja1!AG69)","v":""}]
[null,"Inscripció equip 5",null,null,null,{"$f":"IF(AND(D107=\"\",COUNTBLANK(B111:B115)=5),\"INSCRIPCIÓ EN BLANC\",IF(COUNTBLANK(I111:I115)+COUNTIF(I111:I115,\"Correcte\")<5,\"INSCRIPCIÓ ERRÒNIA\",IF(AND(D107<>\"\",COUNTBLANK(B111:B115)<4),\"INSCRIPCIÓ COMPLETA\",\"INSCRIPCIÓ INCOMPLETA\")))","v":"INSCRIPCIÓ EN BLANC"},null,null,null,null,{"$f":"IF(Hoja1!AB70=\"\",\"\",Hoja1!AB70)","v":""},{"$f":"IF(Hoja1!AC70=\"\",\"\",Hoja1!AC70)","v":""},{"$f":"IF(Hoja1!AD70=\"\",\"\",Hoja1!AD70)","v":""},{"$f":"IF(Hoja1!AE70=\"\",\"\",Hoja1!AE70)","v":""},{"$f":"IF(Hoja1!AF70=\"\",\"\",Hoja1!AF70)","v":""},{"$f":"IF(Hoja1!AG70=\"\",\"\",Hoja1!AG70)","v":""}]
[null,null,null,null,null,null,null,null,null,null,{"$f":"IF(Hoja1!AB71=\"\",\"\",Hoja1!AB71)","v":""},{"$f":"IF(Hoja1!AC71=\"\",\"\",Hoja1!AC71)","v":""},{"$f":"IF(Hoja1!AD71=\"\",\"\",Hoja1!AD71)","v":""},{"$f":"IF(Hoja1!AE71=\"\",\"\",Hoja1!AE71)","v":""},{"$f":"IF(Hoja1!AF71=\"\",\"\",Hoja1!AF71)","v":""},{"$f":"IF(Hoja1!AG71=\"\",\"\",Hoja1!AG71)","v":""}]
[null,"Nom per defecte:",null,{"$f":"IF($B$35=\"\",\"\",$B$35&INDEX(Hoja1!$L$72:$L$86,VALUE(RIGHT(B103))))","v":""},null,null,null,null,null,null,{"$f":"IF(Hoja1!AB72=\"\",\"\",Hoja1!AB72)","v":""},{"$f":"IF(Hoja1!AC72=\"\",\"\",Hoja1!AC72)","v":""},{"$f":"IF(Hoja1!AD72=\"\",\"\",Hoja1!AD72)","v":""},{"$f":"IF(Hoja1!AE72=\"\",\"\",Hoja1!AE72)","v":""},{"$f":"IF(Hoja1!AF72=\"\",\"\",Hoja1!AF72)","v":""},{"$f":"IF(Hoja1!AG72=\"\",\"\",Hoja1!AG72)","v":""}]
[null,"Nom modificat (opcional):",null,null,null,null,null,null,null,null,{"$f":"IF(Hoja1!AB73=\"\",\"\",Hoja1!AB73)","v":""},{"$f":"IF(Hoja1!AC73=\"\",\"\",Hoja1!AC73)","v":""},{"$f":"IF(Hoja1!AD73=\"\",\"\",Hoja1!AD73)","v":""},{"$f":"IF(Hoja1!AE73=\"\",\"\",Hoja1!AE73)","v":""},{"$f":"IF(Hoja1!AF73=\"\",\"\",Hoja1!AF73)","v":""},{"$f":"IF(Hoja1!AG73=\"\",\"\",Hoja1!AG73)","v":""}]
[null,"Categoria:",null,null,null,null,null,null,null,null,{"$f":"IF(Hoja1!AB74=\"\",\"\",Hoja1!AB74)","v":""},{"$f":"IF(Hoja1!AC74=\"\",\"\",Hoja1!AC74)","v":""},{"$f":"IF(Hoja1!AD74=\"\",\"\",Hoja1!AD74)","v":""},{"$f":"IF(Hoja1!AE74=\"\",\"\",Hoja1!AE74)","v":""},{"$f":"IF(Hoja1!AF74=\"\",\"\",Hoja1!AF74)","v":""},{"$f":"IF(Hoja1!AG74=\"\",\"\",Hoja1!AG74)","v":""}]
[null,"Rànquing:",null,{"$f":"IF(COUNTBLANK(H111:H115)=5,\"\",MAX(H111:H115)+IF(COUNTBLANK(H111:H115)=4,0,LARGE(H111:H115,2)))","v":""},null,null,null,null,null,null,{"$f":"IF(Hoja1!AB75=\"\",\"\",Hoja1!AB75)","v":""},{"$f":"IF(Hoja1!AC75=\"\",\"\",Hoja1!AC75)","v":""},{"$f":"IF(Hoja1!AD75=\"\",\"\",Hoja1!AD75)","v":""},{"$f":"IF(Hoja1!AE75=\"\",\"\",Hoja1!AE75)","v":""},{"$f":"IF(Hoja1!AF75=\"\",\"\",Hoja1!AF75)","v":""},{"$f":"IF(Hoja1!AG75=\"\",\"\",Hoja1!AG75)","v":""}]
[null,null,null,null,null,null,null,null,null,null,{"$f":"IF(Hoja1!AB76=\"\",\"\",Hoja1!AB76)","v":""},{"$f":"IF(Hoja1!AC76=\"\",\"\",Hoja1!AC76)","v":""},{"$f":"IF(Hoja1!AD76=\"\",\"\",Hoja1!AD76)","v":""},{"$f":"IF(Hoja1!AE76=\"\",\"\",Hoja1!AE76)","v":""},{"$f":"IF(Hoja1!AF76=\"\",\"\",Hoja1!AF76)","v":""},{"$f":"IF(Hoja1!AG76=\"\",\"\",Hoja1!AG76)","v":""}]
[null,"NP","JUGADOR/A",null,"EDAT","CLUB","SEXE","rk tot","Error?",null,{"$f":"IF(Hoja1!AB77=\"\",\"\",Hoja1!AB77)","v":""},{"$f":"IF(Hoja1!AC77=\"\",\"\",Hoja1!AC77)","v":""},{"$f":"IF(Hoja1!AD77=\"\",\"\",Hoja1!AD77)","v":""},{"$f":"IF(Hoja1!AE77=\"\",\"\",Hoja1!AE77)","v":""},{"$f":"IF(Hoja1!AF77=\"\",\"\",Hoja1!AF77)","v":""},{"$f":"IF(Hoja1!AG77=\"\",\"\",Hoja1!AG77)","v":""}]
[null,null,{"$f":"IF(COUNTIF(Hoja1!A:A,B111)=1,VLOOKUP(B111,Hoja1!A:F,2,0),\"\")","v":""},null,{"$f":"IF(COUNTIF(Hoja1!A:A,B111)=1,VLOOKUP(B111,Hoja1!A:F,3,0),\"\")","v":""},{"$f":"IF(COUNTIF(Hoja1!A:A,B111)=1,VLOOKUP(B111,Hoja1!A:F,4,0),\"\")","v":""},{"$f":"IF(COUNTIF(Hoja1!A:A,B111)=1,VLOOKUP(B111,Hoja1!A:F,5,0),\"\")","v":""},{"$f":"IF(COUNTIF(Hoja1!A:A,B111)=1,VLOOKUP(B111,Hoja1!A:F,6,0),\"\")","v":""},{"$f":"IF(B111=\"\",\"\",IF(COUNTIF(Hoja1!A:A,B111)=0,\"NP erroni\",IF(COUNTIF(B:B,B111)>1,\"Inscrit/a a + d'1 equip\",IF(VLOOKUP($D$107,Hoja1!$K$53:$L$58,2,0)=0,IF(G111=\"F\",\"Correcte\",\"Error sexe\"),IF(VLOOKUP($D$107,Hoja1!$K$53:$L$58,2,0)<VLOOKUP(E111,Hoja1!$K$60:$L$70,2,0),\"Error edat\",\"Correcte\")))))","v":""},null,{"$f":"IF(Hoja1!AB78=\"\",\"\",Hoja1!AB78)","v":""},{"$f":"IF(Hoja1!AC78=\"\",\"\",Hoja1!AC78)","v":""},{"$f":"IF(Hoja1!AD78=\"\",\"\",Hoja1!AD78)","v":""},{"$f":"IF(Hoja1!AE78=\"\",\"\",Hoja1!AE78)","v":""},{"$f":"IF(Hoja1!AF78=\"\",\"\",Hoja1!AF78)","v":""},{"$f":"IF(Hoja1!AG78=\"\",\"\",Hoja1!AG78)","v":""}]
[null,null,{"$f":"IF(COUNTIF(Hoja1!A:A,B112)=1,VLOOKUP(B112,Hoja1!A:F,2,0),\"\")","v":""},null,{"$f":"IF(COUNTIF(Hoja1!A:A,B112)=1,VLOOKUP(B112,Hoja1!A:F,3,0),\"\")","v":""},{"$f":"IF(COUNTIF(Hoja1!A:A,B112)=1,VLOOKUP(B112,Hoja1!A:F,4,0),\"\")","v":""},{"$f":"IF(COUNTIF(Hoja1!A:A,B112)=1,VLOOKUP(B112,Hoja1!A:F,5,0),\"\")","v":""},{"$f":"IF(COUNTIF(Hoja1!A:A,B112)=1,VLOOKUP(B112,Hoja1!A:F,6,0),\"\")","v":""},{"$f":"IF(B112=\"\",\"\",IF(COUNTIF(Hoja1!A:A,B112)=0,\"NP erroni\",IF(COUNTIF(B:B,B112)>1,\"Inscrit/a a + d'1 equip\",IF(VLOOKUP($D$107,Hoja1!$K$53:$L$58,2,0)=0,IF(G112=\"F\",\"Correcte\",\"Error sexe\"),IF(VLOOKUP($D$107,Hoja1!$K$53:$L$58,2,0)<VLOOKUP(E112,Hoja1!$K$60:$L$70,2,0),\"Error edat\",\"Correcte\")))))","v":""},null,{"$f":"IF(Hoja1!AB79=\"\",\"\",Hoja1!AB79)","v":""},{"$f":"IF(Hoja1!AC79=\"\",\"\",Hoja1!AC79)","v":""},{"$f":"IF(Hoja1!AD79=\"\",\"\",Hoja1!AD79)","v":""},{"$f":"IF(Hoja1!AE79=\"\",\"\",Hoja1!AE79)","v":""},{"$f":"IF(Hoja1!AF79=\"\",\"\",Hoja1!AF79)","v":""},{"$f":"IF(Hoja1!AG79=\"\",\"\",Hoja1!AG79)","v":""}]
[null,null,{"$f":"IF(COUNTIF(Hoja1!A:A,B113)=1,VLOOKUP(B113,Hoja1!A:F,2,0),\"\")","v":""},null,{"$f":"IF(COUNTIF(Hoja1!A:A,B113)=1,VLOOKUP(B113,Hoja1!A:F,3,0),\"\")","v":""},{"$f":"IF(COUNTIF(Hoja1!A:A,B113)=1,VLOOKUP(B113,Hoja1!A:F,4,0),\"\")","v":""},{"$f":"IF(COUNTIF(Hoja1!A:A,B113)=1,VLOOKUP(B113,Hoja1!A:F,5,0),\"\")","v":""},{"$f":"IF(COUNTIF(Hoja1!A:A,B113)=1,VLOOKUP(B113,Hoja1!A:F,6,0),\"\")","v":""},{"$f":"IF(B113=\"\",\"\",IF(COUNTIF(Hoja1!A:A,B113)=0,\"NP erroni\",IF(COUNTIF(B:B,B113)>1,\"Inscrit/a a + d'1 equip\",IF(VLOOKUP($D$107,Hoja1!$K$53:$L$58,2,0)=0,IF(G113=\"F\",\"Correcte\",\"Error sexe\"),IF(VLOOKUP($D$107,Hoja1!$K$53:$L$58,2,0)<VLOOKUP(E113,Hoja1!$K$60:$L$70,2,0),\"Error edat\",\"Correcte\")))))","v":""},null,{"$f":"IF(Hoja1!AB80=\"\",\"\",Hoja1!AB80)","v":""},{"$f":"IF(Hoja1!AC80=\"\",\"\",Hoja1!AC80)","v":""},{"$f":"IF(Hoja1!AD80=\"\",\"\",Hoja1!AD80)","v":""},{"$f":"IF(Hoja1!AE80=\"\",\"\",Hoja1!AE80)","v":""},{"$f":"IF(Hoja1!AF80=\"\",\"\",Hoja1!AF80)","v":""},{"$f":"IF(Hoja1!AG80=\"\",\"\",Hoja1!AG80)","v":""}]
[null,null,{"$f":"IF(COUNTIF(Hoja1!A:A,B114)=1,VLOOKUP(B114,Hoja1!A:F,2,0),\"\")","v":""},null,{"$f":"IF(COUNTIF(Hoja1!A:A,B114)=1,VLOOKUP(B114,Hoja1!A:F,3,0),\"\")","v":""},{"$f":"IF(COUNTIF(Hoja1!A:A,B114)=1,VLOOKUP(B114,Hoja1!A:F,4,0),\"\")","v":""},{"$f":"IF(COUNTIF(Hoja1!A:A,B114)=1,VLOOKUP(B114,Hoja1!A:F,5,0),\"\")","v":""},{"$f":"IF(COUNTIF(Hoja1!A:A,B114)=1,VLOOKUP(B114,Hoja1!A:F,6,0),\"\")","v":""},{"$f":"IF(B114=\"\",\"\",IF(COUNTIF(Hoja1!A:A,B114)=0,\"NP erroni\",IF(COUNTIF(B:B,B114)>1,\"Inscrit/a a + d'1 equip\",IF(VLOOKUP($D$107,Hoja1!$K$53:$L$58,2,0)=0,IF(G114=\"F\",\"Correcte\",\"Error sexe\"),IF(VLOOKUP($D$107,Hoja1!$K$53:$L$58,2,0)<VLOOKUP(E114,Hoja1!$K$60:$L$70,2,0),\"Error edat\",\"Correcte\")))))","v":""},null,{"$f":"IF(Hoja1!AB81=\"\",\"\",Hoja1!AB81)","v":""},{"$f":"IF(Hoja1!AC81=\"\",\"\",Hoja1!AC81)","v":""},{"$f":"IF(Hoja1!AD81=\"\",\"\",Hoja1!AD81)","v":""},{"$f":"IF(Hoja1!AE81=\"\",\"\",Hoja1!AE81)","v":""},{"$f":"IF(Hoja1!AF81=\"\",\"\",Hoja1!AF81)","v":""},{"$f":"IF(Hoja1!AG81=\"\",\"\",Hoja1!AG81)","v":""}]
[null,null,{"$f":"IF(COUNTIF(Hoja1!A:A,B115)=1,VLOOKUP(B115,Hoja1!A:F,2,0),\"\")","v":""},null,{"$f":"IF(COUNTIF(Hoja1!A:A,B115)=1,VLOOKUP(B115,Hoja1!A:F,3,0),\"\")","v":""},{"$f":"IF(COUNTIF(Hoja1!A:A,B115)=1,VLOOKUP(B115,Hoja1!A:F,4,0),\"\")","v":""},{"$f":"IF(COUNTIF(Hoja1!A:A,B115)=1,VLOOKUP(B115,Hoja1!A:F,5,0),\"\")","v":""},{"$f":"IF(COUNTIF(Hoja1!A:A,B115)=1,VLOOKUP(B115,Hoja1!A:F,6,0),\"\")","v":""},{"$f":"IF(B115=\"\",\"\",IF(COUNTIF(Hoja1!A:A,B115)=0,\"NP erroni\",IF(COUNTIF(B:B,B115)>1,\"Inscrit/a a + d'1 equip\",IF(VLOOKUP($D$107,Hoja1!$K$53:$L$58,2,0)=0,IF(G115=\"F\",\"Correcte\",\"Error sexe\"),IF(VLOOKUP($D$107,Hoja1!$K$53:$L$58,2,0)<VLOOKUP(E115,Hoja1!$K$60:$L$70,2,0),\"Error edat\",\"Correcte\")))))","v":""},null,{"$f":"IF(Hoja1!AB82=\"\",\"\",Hoja1!AB82)","v":""},{"$f":"IF(Hoja1!AC82=\"\",\"\",Hoja1!AC82)","v":""},{"$f":"IF(Hoja1!AD82=\"\",\"\",Hoja1!AD82)","v":""},{"$f":"IF(Hoja1!AE82=\"\",\"\",Hoja1!AE82)","v":""},{"$f":"IF(Hoja1!AF82=\"\",\"\",Hoja1!AF82)","v":""},{"$f":"IF(Hoja1!AG82=\"\",\"\",Hoja1!AG82)","v":""}]
[null,null,null,null,null,null,null,null,null,null,{"$f":"IF(Hoja1!AB83=\"\",\"\",Hoja1!AB83)","v":""},{"$f":"IF(Hoja1!AC83=\"\",\"\",Hoja1!AC83)","v":""},{"$f":"IF(Hoja1!AD83=\"\",\"\",Hoja1!AD83)","v":""},{"$f":"IF(Hoja1!AE83=\"\",\"\",Hoja1!AE83)","v":""},{"$f":"IF(Hoja1!AF83=\"\",\"\",Hoja1!AF83)","v":""},{"$f":"IF(Hoja1!AG83=\"\",\"\",Hoja1!AG83)","v":""}]
[null,null,null,null,null,null,null,null,null,null,{"$f":"IF(Hoja1!AB84=\"\",\"\",Hoja1!AB84)","v":""},{"$f":"IF(Hoja1!AC84=\"\",\"\",Hoja1!AC84)","v":""},{"$f":"IF(Hoja1!AD84=\"\",\"\",Hoja1!AD84)","v":""},{"$f":"IF(Hoja1!AE84=\"\",\"\",Hoja1!AE84)","v":""},{"$f":"IF(Hoja1!AF84=\"\",\"\",Hoja1!AF84)","v":""},{"$f":"IF(Hoja1!AG84=\"\",\"\",Hoja1!AG84)","v":""}]
[null,"Inscripció equip 6",null,null,null,{"$f":"IF(AND(D122=\"\",COUNTBLANK(B126:B130)=5),\"INSCRIPCIÓ EN BLANC\",IF(COUNTBLANK(I126:I130)+COUNTIF(I126:I130,\"Correcte\")<5,\"INSCRIPCIÓ ERRÒNIA\",IF(AND(D122<>\"\",COUNTBLANK(B126:B130)<4),\"INSCRIPCIÓ COMPLETA\",\"INSCRIPCIÓ INCOMPLETA\")))","v":"INSCRIPCIÓ EN BLANC"},null,null,null,null,{"$f":"IF(Hoja1!AB85=\"\",\"\",Hoja1!AB85)","v":""},{"$f":"IF(Hoja1!AC85=\"\",\"\",Hoja1!AC85)","v":""},{"$f":"IF(Hoja1!AD85=\"\",\"\",Hoja1!AD85)","v":""},{"$f":"IF(Hoja1!AE85=\"\",\"\",Hoja1!AE85)","v":""},{"$f":"IF(Hoja1!AF85=\"\",\"\",Hoja1!AF85)","v":""},{"$f":"IF(Hoja1!AG85=\"\",\"\",Hoja1!AG85)","v":""}]
[null,null,null,null,null,null,null,null,null,null,{"$f":"IF(Hoja1!AB86=\"\",\"\",Hoja1!AB86)","v":""},{"$f":"IF(Hoja1!AC86=\"\",\"\",Hoja1!AC86)","v":""},{"$f":"IF(Hoja1!AD86=\"\",\"\",Hoja1!AD86)","v":""},{"$f":"IF(Hoja1!AE86=\"\",\"\",Hoja1!AE86)","v":""},{"$f":"IF(Hoja1!AF86=\"\",\"\",Hoja1!AF86)","v":""},{"$f":"IF(Hoja1!AG86=\"\",\"\",Hoja1!AG86)","v":""}]
[null,"Nom per defecte:",null,{"$f":"IF($B$35=\"\",\"\",$B$35&INDEX(Hoja1!$L$72:$L$86,VALUE(RIGHT(B118))))","v":""},null,null,null,null,null,null,{"$f":"IF(Hoja1!AB87=\"\",\"\",Hoja1!AB87)","v":""},{"$f":"IF(Hoja1!AC87=\"\",\"\",Hoja1!AC87)","v":""},{"$f":"IF(Hoja1!AD87=\"\",\"\",Hoja1!AD87)","v":""},{"$f":"IF(Hoja1!AE87=\"\",\"\",Hoja1!AE87)","v":""},{"$f":"IF(Hoja1!AF87=\"\",\"\",Hoja1!AF87)","v":""},{"$f":"IF(Hoja1!AG87=\"\",\"\",Hoja1!AG87)","v":""}]
[null,"Nom modificat (opcional):",null,null,null,null,null,null,null,null,{"$f":"IF(Hoja1!AB88=\"\",\"\",Hoja1!AB88)","v":""},{"$f":"IF(Hoja1!AC88=\"\",\"\",Hoja1!AC88)","v":""},{"$f":"IF(Hoja1!AD88=\"\",\"\",Hoja1!AD88)","v":""},{"$f":"IF(Hoja1!AE88=\"\",\"\",Hoja1!AE88)","v":""},{"$f":"IF(Hoja1!AF88=\"\",\"\",Hoja1!AF88)","v":""},{"$f":"IF(Hoja1!AG88=\"\",\"\",Hoja1!AG88)","v":""}]
[null,"Categoria:",null,null,null,null,null,null,null,null,{"$f":"IF(Hoja1!AB89=\"\",\"\",Hoja1!AB89)","v":""},{"$f":"IF(Hoja1!AC89=\"\",\"\",Hoja1!AC89)","v":""},{"$f":"IF(Hoja1!AD89=\"\",\"\",Hoja1!AD89)","v":""},{"$f":"IF(Hoja1!AE89=\"\",\"\",Hoja1!AE89)","v":""},{"$f":"IF(Hoja1!AF89=\"\",\"\",Hoja1!AF89)","v":""},{"$f":"IF(Hoja1!AG89=\"\",\"\",Hoja1!AG89)","v":""}]
[null,"Rànquing:",null,{"$f":"IF(COUNTBLANK(H126:H130)=5,\"\",MAX(H126:H130)+IF(COUNTBLANK(H126:H130)=4,0,LARGE(H126:H130,2)))","v":""},null,null,null,null,null,null,{"$f":"IF(Hoja1!AB90=\"\",\"\",Hoja1!AB90)","v":""},{"$f":"IF(Hoja1!AC90=\"\",\"\",Hoja1!AC90)","v":""},{"$f":"IF(Hoja1!AD90=\"\",\"\",Hoja1!AD90)","v":""},{"$f":"IF(Hoja1!AE90=\"\",\"\",Hoja1!AE90)","v":""},{"$f":"IF(Hoja1!AF90=\"\",\"\",Hoja1!AF90)","v":""},{"$f":"IF(Hoja1!AG90=\"\",\"\",Hoja1!AG90)","v":""}]
[null,null,null,null,null,null,null,null,null,null,{"$f":"IF(Hoja1!AB91=\"\",\"\",Hoja1!AB91)","v":""},{"$f":"IF(Hoja1!AC91=\"\",\"\",Hoja1!AC91)","v":""},{"$f":"IF(Hoja1!AD91=\"\",\"\",Hoja1!AD91)","v":""},{"$f":"IF(Hoja1!AE91=\"\",\"\",Hoja1!AE91)","v":""},{"$f":"IF(Hoja1!AF91=\"\",\"\",Hoja1!AF91)","v":""},{"$f":"IF(Hoja1!AG91=\"\",\"\",Hoja1!AG91)","v":""}]
[null,"NP","JUGADOR/A",null,"EDAT","CLUB","SEXE","rk tot","Error?",null,{"$f":"IF(Hoja1!AB92=\"\",\"\",Hoja1!AB92)","v":""},{"$f":"IF(Hoja1!AC92=\"\",\"\",Hoja1!AC92)","v":""},{"$f":"IF(Hoja1!AD92=\"\",\"\",Hoja1!AD92)","v":""},{"$f":"IF(Hoja1!AE92=\"\",\"\",Hoja1!AE92)","v":""},{"$f":"IF(Hoja1!AF92=\"\",\"\",Hoja1!AF92)","v":""},{"$f":"IF(Hoja1!AG92=\"\",\"\",Hoja1!AG92)","v":""}]
[null,null,{"$f":"IF(COUNTIF(Hoja1!A:A,B126)=1,VLOOKUP(B126,Hoja1!A:F,2,0),\"\")","v":""},null,{"$f":"IF(COUNTIF(Hoja1!A:A,B126)=1,VLOOKUP(B126,Hoja1!A:F,3,0),\"\")","v":""},{"$f":"IF(COUNTIF(Hoja1!A:A,B126)=1,VLOOKUP(B126,Hoja1!A:F,4,0),\"\")","v":""},{"$f":"IF(COUNTIF(Hoja1!A:A,B126)=1,VLOOKUP(B126,Hoja1!A:F,5,0),\"\")","v":""},{"$f":"IF(COUNTIF(Hoja1!A:A,B126)=1,VLOOKUP(B126,Hoja1!A:F,6,0),\"\")","v":""},{"$f":"IF(B126=\"\",\"\",IF(COUNTIF(Hoja1!A:A,B126)=0,\"NP erroni\",IF(COUNTIF(B:B,B126)>1,\"Inscrit/a a + d'1 equip\",IF(VLOOKUP($D$122,Hoja1!$K$53:$L$58,2,0)=0,IF(G126=\"F\",\"Correcte\",\"Error sexe\"),IF(VLOOKUP($D$122,Hoja1!$K$53:$L$58,2,0)<VLOOKUP(E126,Hoja1!$K$60:$L$70,2,0),\"Error edat\",\"Correcte\")))))","v":""},null,{"$f":"IF(Hoja1!AB93=\"\",\"\",Hoja1!AB93)","v":""},{"$f":"IF(Hoja1!AC93=\"\",\"\",Hoja1!AC93)","v":""},{"$f":"IF(Hoja1!AD93=\"\",\"\",Hoja1!AD93)","v":""},{"$f":"IF(Hoja1!AE93=\"\",\"\",Hoja1!AE93)","v":""},{"$f":"IF(Hoja1!AF93=\"\",\"\",Hoja1!AF93)","v":""},{"$f":"IF(Hoja1!AG93=\"\",\"\",Hoja1!AG93)","v":""}]
[null,null,{"$f":"IF(COUNTIF(Hoja1!A:A,B127)=1,VLOOKUP(B127,Hoja1!A:F,2,0),\"\")","v":""},null,{"$f":"IF(COUNTIF(Hoja1!A:A,B127)=1,VLOOKUP(B127,Hoja1!A:F,3,0),\"\")","v":""},{"$f":"IF(COUNTIF(Hoja1!A:A,B127)=1,VLOOKUP(B127,Hoja1!A:F,4,0),\"\")","v":""},{"$f":"IF(COUNTIF(Hoja1!A:A,B127)=1,VLOOKUP(B127,Hoja1!A:F,5,0),\"\")","v":""},{"$f":"IF(COUNTIF(Hoja1!A:A,B127)=1,VLOOKUP(B127,Hoja1!A:F,6,0),\"\")","v":""},{"$f":"IF(B127=\"\",\"\",IF(COUNTIF(Hoja1!A:A,B127)=0,\"NP erroni\",IF(COUNTIF(B:B,B127)>1,\"Inscrit/a a + d'1 equip\",IFERROR(IF(VLOOKUP($D$122,Hoja1!$K$53:$L$58,2,0)=0,IF(G127=\"F\",\"Correcte\",\"Error sexe\"),IF(VLOOKUP($D$122,Hoja1!$K$53:$L$58,2,0)<VLOOKUP(E127,Hoja1!$K$60:$L$70,2,0),\"Error edat\",\"Correcte\")),\"Introduïu categoria\"))))","v":""},null,{"$f":"IF(Hoja1!AB94=\"\",\"\",Hoja1!AB94)","v":""},{"$f":"IF(Hoja1!AC94=\"\",\"\",Hoja1!AC94)","v":""},{"$f":"IF(Hoja1!AD94=\"\",\"\",Hoja1!AD94)","v":""},{"$f":"IF(Hoja1!AE94=\"\",\"\",Hoja1!AE94)","v":""},{"$f":"IF(Hoja1!AF94=\"\",\"\",Hoja1!AF94)","v":""},{"$f":"IF(Hoja1!AG94=\"\",\"\",Hoja1!AG94)","v":""}]
[null,null,{"$f":"IF(COUNTIF(Hoja1!A:A,B128)=1,VLOOKUP(B128,Hoja1!A:F,2,0),\"\")","v":""},null,{"$f":"IF(COUNTIF(Hoja1!A:A,B128)=1,VLOOKUP(B128,Hoja1!A:F,3,0),\"\")","v":""},{"$f":"IF(COUNTIF(Hoja1!A:A,B128)=1,VLOOKUP(B128,Hoja1!A:F,4,0),\"\")","v":""},{"$f":"IF(COUNTIF(Hoja1!A:A,B128)=1,VLOOKUP(B128,Hoja1!A:F,5,0),\"\")","v":""},{"$f":"IF(COUNTIF(Hoja1!A:A,B128)=1,VLOOKUP(B128,Hoja1!A:F,6,0),\"\")","v":""},{"$f":"IF(B128=\"\",\"\",IF(COUNTIF(Hoja1!A:A,B128)=0,\"NP erroni\",IF(COUNTIF(B:B,B128)>1,\"Inscrit/a a + d'1 equip\",IF(VLOOKUP($D$122,Hoja1!$K$53:$L$58,2,0)=0,IF(G128=\"F\",\"Correcte\",\"Error sexe\"),IF(VLOOKUP($D$122,Hoja1!$K$53:$L$58,2,0)<VLOOKUP(E128,Hoja1!$K$60:$L$70,2,0),\"Error edat\",\"Correcte\")))))","v":""},null,{"$f":"IF(Hoja1!AB95=\"\",\"\",Hoja1!AB95)","v":""},{"$f":"IF(Hoja1!AC95=\"\",\"\",Hoja1!AC95)","v":""},{"$f":"IF(Hoja1!AD95=\"\",\"\",Hoja1!AD95)","v":""},{"$f":"IF(Hoja1!AE95=\"\",\"\",Hoja1!AE95)","v":""},{"$f":"IF(Hoja1!AF95=\"\",\"\",Hoja1!AF95)","v":""},{"$f":"IF(Hoja1!AG95=\"\",\"\",Hoja1!AG95)","v":""}]
[null,null,{"$f":"IF(COUNTIF(Hoja1!A:A,B129)=1,VLOOKUP(B129,Hoja1!A:F,2,0),\"\")","v":""},null,{"$f":"IF(COUNTIF(Hoja1!A:A,B129)=1,VLOOKUP(B129,Hoja1!A:F,3,0),\"\")","v":""},{"$f":"IF(COUNTIF(Hoja1!A:A,B129)=1,VLOOKUP(B129,Hoja1!A:F,4,0),\"\")","v":""},{"$f":"IF(COUNTIF(Hoja1!A:A,B129)=1,VLOOKUP(B129,Hoja1!A:F,5,0),\"\")","v":""},{"$f":"IF(COUNTIF(Hoja1!A:A,B129)=1,VLOOKUP(B129,Hoja1!A:F,6,0),\"\")","v":""},{"$f":"IF(B129=\"\",\"\",IF(COUNTIF(Hoja1!A:A,B129)=0,\"NP erroni\",IF(COUNTIF(B:B,B129)>1,\"Inscrit/a a + d'1 equip\",IF(VLOOKUP($D$122,Hoja1!$K$53:$L$58,2,0)=0,IF(G129=\"F\",\"Correcte\",\"Error sexe\"),IF(VLOOKUP($D$122,Hoja1!$K$53:$L$58,2,0)<VLOOKUP(E129,Hoja1!$K$60:$L$70,2,0),\"Error edat\",\"Correcte\")))))","v":""},null,{"$f":"IF(Hoja1!AB96=\"\",\"\",Hoja1!AB96)","v":""},{"$f":"IF(Hoja1!AC96=\"\",\"\",Hoja1!AC96)","v":""},{"$f":"IF(Hoja1!AD96=\"\",\"\",Hoja1!AD96)","v":""},{"$f":"IF(Hoja1!AE96=\"\",\"\",Hoja1!AE96)","v":""},{"$f":"IF(Hoja1!AF96=\"\",\"\",Hoja1!AF96)","v":""},{"$f":"IF(Hoja1!AG96=\"\",\"\",Hoja1!AG96)","v":""}]
[null,null,{"$f":"IF(COUNTIF(Hoja1!A:A,B130)=1,VLOOKUP(B130,Hoja1!A:F,2,0),\"\")","v":""},null,{"$f":"IF(COUNTIF(Hoja1!A:A,B130)=1,VLOOKUP(B130,Hoja1!A:F,3,0),\"\")","v":""},{"$f":"IF(COUNTIF(Hoja1!A:A,B130)=1,VLOOKUP(B130,Hoja1!A:F,4,0),\"\")","v":""},{"$f":"IF(COUNTIF(Hoja1!A:A,B130)=1,VLOOKUP(B130,Hoja1!A:F,5,0),\"\")","v":""},{"$f":"IF(COUNTIF(Hoja1!A:A,B130)=1,VLOOKUP(B130,Hoja1!A:F,6,0),\"\")","v":""},{"$f":"IF(B130=\"\",\"\",IF(COUNTIF(Hoja1!A:A,B130)=0,\"NP erroni\",IF(COUNTIF(B:B,B130)>1,\"Inscrit/a a + d'1 equip\",IF(VLOOKUP($D$122,Hoja1!$K$53:$L$58,2,0)=0,IF(G130=\"F\",\"Correcte\",\"Error sexe\"),IF(VLOOKUP($D$122,Hoja1!$K$53:$L$58,2,0)<VLOOKUP(E130,Hoja1!$K$60:$L$70,2,0),\"Error edat\",\"Correcte\")))))","v":""},null,{"$f":"IF(Hoja1!AB97=\"\",\"\",Hoja1!AB97)","v":""},{"$f":"IF(Hoja1!AC97=\"\",\"\",Hoja1!AC97)","v":""},{"$f":"IF(Hoja1!AD97=\"\",\"\",Hoja1!AD97)","v":""},{"$f":"IF(Hoja1!AE97=\"\",\"\",Hoja1!AE97)","v":""},{"$f":"IF(Hoja1!AF97=\"\",\"\",Hoja1!AF97)","v":""},{"$f":"IF(Hoja1!AG97=\"\",\"\",Hoja1!AG97)","v":""}]
[null,null,null,null,null,null,null,null,null,null,{"$f":"IF(Hoja1!AB98=\"\",\"\",Hoja1!AB98)","v":""},{"$f":"IF(Hoja1!AC98=\"\",\"\",Hoja1!AC98)","v":""},{"$f":"IF(Hoja1!AD98=\"\",\"\",Hoja1!AD98)","v":""},{"$f":"IF(Hoja1!AE98=\"\",\"\",Hoja1!AE98)","v":""},{"$f":"IF(Hoja1!AF98=\"\",\"\",Hoja1!AF98)","v":""},{"$f":"IF(Hoja1!AG98=\"\",\"\",Hoja1!AG98)","v":""}]
[null,null,null,null,null,null,null,null,null,null,{"$f":"IF(Hoja1!AB99=\"\",\"\",Hoja1!AB99)","v":""},{"$f":"IF(Hoja1!AC99=\"\",\"\",Hoja1!AC99)","v":""},{"$f":"IF(Hoja1!AD99=\"\",\"\",Hoja1!AD99)","v":""},{"$f":"IF(Hoja1!AE99=\"\",\"\",Hoja1!AE99)","v":""},{"$f":"IF(Hoja1!AF99=\"\",\"\",Hoja1!AF99)","v":""},{"$f":"IF(Hoja1!AG99=\"\",\"\",Hoja1!AG99)","v":""}]
[null,"Inscripció equip 7",null,null,null,{"$f":"IF(AND(D137=\"\",COUNTBLANK(B141:B145)=5),\"INSCRIPCIÓ EN BLANC\",IF(COUNTBLANK(I141:I145)+COUNTIF(I141:I145,\"Correcte\")<5,\"INSCRIPCIÓ ERRÒNIA\",IF(AND(D137<>\"\",COUNTBLANK(B141:B145)<4),\"INSCRIPCIÓ COMPLETA\",\"INSCRIPCIÓ INCOMPLETA\")))","v":"INSCRIPCIÓ EN BLANC"},null,null,null,null,{"$f":"IF(Hoja1!AB100=\"\",\"\",Hoja1!AB100)","v":""},{"$f":"IF(Hoja1!AC100=\"\",\"\",Hoja1!AC100)","v":""},{"$f":"IF(Hoja1!AD100=\"\",\"\",Hoja1!AD100)","v":""},{"$f":"IF(Hoja1!AE100=\"\",\"\",Hoja1!AE100)","v":""},{"$f":"IF(Hoja1!AF100=\"\",\"\",Hoja1!AF100)","v":""},{"$f":"IF(Hoja1!AG100=\"\",\"\",Hoja1!AG100)","v":""}]
[null,null,null,null,null,null,null,null,null,null,{"$f":"IF(Hoja1!AB101=\"\",\"\",Hoja1!AB101)","v":""},{"$f":"IF(Hoja1!AC101=\"\",\"\",Hoja1!AC101)","v":""},{"$f":"IF(Hoja1!AD101=\"\",\"\",Hoja1!AD101)","v":""},{"$f":"IF(Hoja1!AE101=\"\",\"\",Hoja1!AE101)","v":""},{"$f":"IF(Hoja1!AF101=\"\",\"\",Hoja1!AF101)","v":""},{"$f":"IF(Hoja1!AG101=\"\",\"\",Hoja1!AG101)","v":""}]
[null,"Nom per defecte:",null,{"$f":"IF($B$35=\"\",\"\",$B$35&INDEX(Hoja1!$L$72:$L$86,VALUE(RIGHT(B133))))","v":""},null,null,null,null,null,null,{"$f":"IF(Hoja1!AB102=\"\",\"\",Hoja1!AB102)","v":""},{"$f":"IF(Hoja1!AC102=\"\",\"\",Hoja1!AC102)","v":""},{"$f":"IF(Hoja1!AD102=\"\",\"\",Hoja1!AD102)","v":""},{"$f":"IF(Hoja1!AE102=\"\",\"\",Hoja1!AE102)","v":""},{"$f":"IF(Hoja1!AF102=\"\",\"\",Hoja1!AF102)","v":""},{"$f":"IF(Hoja1!AG102=\"\",\"\",Hoja1!AG102)","v":""}]
[null,"Nom modificat (opcional):",null,null,null,null,null,null,null,null,{"$f":"IF(Hoja1!AB103=\"\",\"\",Hoja1!AB103)","v":""},{"$f":"IF(Hoja1!AC103=\"\",\"\",Hoja1!AC103)","v":""},{"$f":"IF(Hoja1!AD103=\"\",\"\",Hoja1!AD103)","v":""},{"$f":"IF(Hoja1!AE103=\"\",\"\",Hoja1!AE103)","v":""},{"$f":"IF(Hoja1!AF103=\"\",\"\",Hoja1!AF103)","v":""},{"$f":"IF(Hoja1!AG103=\"\",\"\",Hoja1!AG103)","v":""}]
[null,"Categoria:",null,null,null,null,null,null,null,null,{"$f":"IF(Hoja1!AB104=\"\",\"\",Hoja1!AB104)","v":""},{"$f":"IF(Hoja1!AC104=\"\",\"\",Hoja1!AC104)","v":""},{"$f":"IF(Hoja1!AD104=\"\",\"\",Hoja1!AD104)","v":""},{"$f":"IF(Hoja1!AE104=\"\",\"\",Hoja1!AE104)","v":""},{"$f":"IF(Hoja1!AF104=\"\",\"\",Hoja1!AF104)","v":""},{"$f":"IF(Hoja1!AG104=\"\",\"\",Hoja1!AG104)","v":""}]
[null,"Rànquing:",null,{"$f":"IF(COUNTBLANK(H141:H145)=5,\"\",MAX(H141:H145)+IF(COUNTBLANK(H141:H145)=4,0,LARGE(H141:H145,2)))","v":""},null,null,null,null,null,null,{"$f":"IF(Hoja1!AB105=\"\",\"\",Hoja1!AB105)","v":""},{"$f":"IF(Hoja1!AC105=\"\",\"\",Hoja1!AC105)","v":""},{"$f":"IF(Hoja1!AD105=\"\",\"\",Hoja1!AD105)","v":""},{"$f":"IF(Hoja1!AE105=\"\",\"\",Hoja1!AE105)","v":""},{"$f":"IF(Hoja1!AF105=\"\",\"\",Hoja1!AF105)","v":""},{"$f":"IF(Hoja1!AG105=\"\",\"\",Hoja1!AG105)","v":""}]
[]
[null,"NP","JUGADOR/A",null,"EDAT","CLUB","SEXE","rk tot","Error?"]
[null,null,{"$f":"IF(COUNTIF(Hoja1!A:A,B141)=1,VLOOKUP(B141,Hoja1!A:F,2,0),\"\")","v":""},null,{"$f":"IF(COUNTIF(Hoja1!A:A,B141)=1,VLOOKUP(B141,Hoja1!A:F,3,0),\"\")","v":""},{"$f":"IF(COUNTIF(Hoja1!A:A,B141)=1,VLOOKUP(B141,Hoja1!A:F,4,0),\"\")","v":""},{"$f":"IF(COUNTIF(Hoja1!A:A,B141)=1,VLOOKUP(B141,Hoja1!A:F,5,0),\"\")","v":""},{"$f":"IF(COUNTIF(Hoja1!A:A,B141)=1,VLOOKUP(B141,Hoja1!A:F,6,0),\"\")","v":""},{"$f":"IF(B141=\"\",\"\",IF(COUNTIF(Hoja1!A:A,B141)=0,\"NP erroni\",IF(COUNTIF(B:B,B141)>1,\"Inscrit/a a + d'1 equip\",IF(VLOOKUP($D$137,Hoja1!$K$53:$L$58,2,0)=0,IF(G141=\"F\",\"Correcte\",\"Error sexe\"),IF(VLOOKUP($D$137,Hoja1!$K$53:$L$58,2,0)<VLOOKUP(E141,Hoja1!$K$60:$L$70,2,0),\"Error edat\",\"Correcte\")))))","v":""}]
[null,null,{"$f":"IF(COUNTIF(Hoja1!A:A,B142)=1,VLOOKUP(B142,Hoja1!A:F,2,0),\"\")","v":""},null,{"$f":"IF(COUNTIF(Hoja1!A:A,B142)=1,VLOOKUP(B142,Hoja1!A:F,3,0),\"\")","v":""},{"$f":"IF(COUNTIF(Hoja1!A:A,B142)=1,VLOOKUP(B142,Hoja1!A:F,4,0),\"\")","v":""},{"$f":"IF(COUNTIF(Hoja1!A:A,B142)=1,VLOOKUP(B142,Hoja1!A:F,5,0),\"\")","v":""},{"$f":"IF(COUNTIF(Hoja1!A:A,B142)=1,VLOOKUP(B142,Hoja1!A:F,6,0),\"\")","v":""},{"$f":"IF(B142=\"\",\"\",IF(COUNTIF(Hoja1!A:A,B142)=0,\"NP erroni\",IF(COUNTIF(B:B,B142)>1,\"Inscrit/a a + d'1 equip\",IF(VLOOKUP($D$137,Hoja1!$K$53:$L$58,2,0)=0,IF(G142=\"F\",\"Correcte\",\"Error sexe\"),IF(VLOOKUP($D$137,Hoja1!$K$53:$L$58,2,0)<VLOOKUP(E142,Hoja1!$K$60:$L$70,2,0),\"Error edat\",\"Correcte\")))))","v":""}]
[null,null,{"$f":"IF(COUNTIF(Hoja1!A:A,B143)=1,VLOOKUP(B143,Hoja1!A:F,2,0),\"\")","v":""},null,{"$f":"IF(COUNTIF(Hoja1!A:A,B143)=1,VLOOKUP(B143,Hoja1!A:F,3,0),\"\")","v":""},{"$f":"IF(COUNTIF(Hoja1!A:A,B143)=1,VLOOKUP(B143,Hoja1!A:F,4,0),\"\")","v":""},{"$f":"IF(COUNTIF(Hoja1!A:A,B143)=1,VLOOKUP(B143,Hoja1!A:F,5,0),\"\")","v":""},{"$f":"IF(COUNTIF(Hoja1!A:A,B143)=1,VLOOKUP(B143,Hoja1!A:F,6,0),\"\")","v":""},{"$f":"IF(B143=\"\",\"\",IF(COUNTIF(Hoja1!A:A,B143)=0,\"NP erroni\",IF(COUNTIF(B:B,B143)>1,\"Inscrit/a a + d'1 equip\",IF(VLOOKUP($D$137,Hoja1!$K$53:$L$58,2,0)=0,IF(G143=\"F\",\"Correcte\",\"Error sexe\"),IF(VLOOKUP($D$137,Hoja1!$K$53:$L$58,2,0)<VLOOKUP(E143,Hoja1!$K$60:$L$70,2,0),\"Error edat\",\"Correcte\")))))","v":""}]
[null,null,{"$f":"IF(COUNTIF(Hoja1!A:A,B144)=1,VLOOKUP(B144,Hoja1!A:F,2,0),\"\")","v":""},null,{"$f":"IF(COUNTIF(Hoja1!A:A,B144)=1,VLOOKUP(B144,Hoja1!A:F,3,0),\"\")","v":""},{"$f":"IF(COUNTIF(Hoja1!A:A,B144)=1,VLOOKUP(B144,Hoja1!A:F,4,0),\"\")","v":""},{"$f":"IF(COUNTIF(Hoja1!A:A,B144)=1,VLOOKUP(B144,Hoja1!A:F,5,0),\"\")","v":""},{"$f":"IF(COUNTIF(Hoja1!A:A,B144)=1,VLOOKUP(B144,Hoja1!A:F,6,0),\"\")","v":""},{"$f":"IF(B144=\"\",\"\",IF(COUNTIF(Hoja1!A:A,B144)=0,\"NP erroni\",IF(COUNTIF(B:B,B144)>1,\"Inscrit/a a + d'1 equip\",IF(VLOOKUP($D$137,Hoja1!$K$53:$L$58,2,0)=0,IF(G144=\"F\",\"Correcte\",\"Error sexe\"),IF(VLOOKUP($D$137,Hoja1!$K$53:$L$58,2,0)<VLOOKUP(E144,Hoja1!$K$60:$L$70,2,0),\"Error edat\",\"Correcte\")))))","v":""}]
[null,null,{"$f":"IF(COUNTIF(Hoja1!A:A,B145)=1,VLOOKUP(B145,Hoja1!A:F,2,0),\"\")","v":""},null,{"$f":"IF(COUNTIF(Hoja1!A:A,B145)=1,VLOOKUP(B145,Hoja1!A:F,3,0),\"\")","v":""},{"$f":"IF(COUNTIF(Hoja1!A:A,B145)=1,VLOOKUP(B145,Hoja1!A:F,4,0),\"\")","v":""},{"$f":"IF(COUNTIF(Hoja1!A:A,B145)=1,VLOOKUP(B145,Hoja1!A:F,5,0),\"\")","v":""},{"$f":"IF(COUNTIF(Hoja1!A:A,B145)=1,VLOOKUP(B145,Hoja1!A:F,6,0),\"\")","v":""},{"$f":"IF(B145=\"\",\"\",IF(COUNTIF(Hoja1!A:A,B145)=0,\"NP erroni\",IF(COUNTIF(B:B,B145)>1,\"Inscrit/a a + d'1 equip\",IF(VLOOKUP($D$137,Hoja1!$K$53:$L$58,2,0)=0,IF(G145=\"F\",\"Correcte\",\"Error sexe\"),IF(VLOOKUP($D$137,Hoja1!$K$53:$L$58,2,0)<VLOOKUP(E145,Hoja1!$K$60:$L$70,2,0),\"Error edat\",\"Correcte\")))))","v":""}]
[]
[]
[null,"Inscripció equip 8",null,null,null,{"$f":"IF(AND(D152=\"\",COUNTBLANK(B156:B160)=5),\"INSCRIPCIÓ EN BLANC\",IF(COUNTBLANK(I156:I160)+COUNTIF(I156:I160,\"Correcte\")<5,\"INSCRIPCIÓ ERRÒNIA\",IF(AND(D152<>\"\",COUNTBLANK(B156:B160)<4),\"INSCRIPCIÓ COMPLETA\",\"INSCRIPCIÓ INCOMPLETA\")))","v":"INSCRIPCIÓ EN BLANC"}]
[]
[null,"Nom per defecte:",null,{"$f":"IF($B$35=\"\",\"\",$B$35&INDEX(Hoja1!$L$72:$L$86,VALUE(RIGHT(B148))))","v":""}]
[null,"Nom modificat (opcional):"]
[null,"Categoria:"]
[null,"Rànquing:",null,{"$f":"IF(COUNTBLANK(H156:H160)=5,\"\",MAX(H156:H160)+IF(COUNTBLANK(H156:H160)=4,0,LARGE(H156:H160,2)))","v":""}]
[]
[null,"NP","JUGADOR/A",null,"EDAT","CLUB","SEXE","rk tot","Error?"]
[null,null,{"$f":"IF(COUNTIF(Hoja1!A:A,B156)=1,VLOOKUP(B156,Hoja1!A:F,2,0),\"\")","v":""},null,{"$f":"IF(COUNTIF(Hoja1!A:A,B156)=1,VLOOKUP(B156,Hoja1!A:F,3,0),\"\")","v":""},{"$f":"IF(COUNTIF(Hoja1!A:A,B156)=1,VLOOKUP(B156,Hoja1!A:F,4,0),\"\")","v":""},{"$f":"IF(COUNTIF(Hoja1!A:A,B156)=1,VLOOKUP(B156,Hoja1!A:F,5,0),\"\")","v":""},{"$f":"IF(COUNTIF(Hoja1!A:A,B156)=1,VLOOKUP(B156,Hoja1!A:F,6,0),\"\")","v":""},{"$f":"IF(B156=\"\",\"\",IF(COUNTIF(Hoja1!A:A,B156)=0,\"NP erroni\",IF(COUNTIF(B:B,B156)>1,\"Inscrit/a a + d'1 equip\",IF(VLOOKUP($D$152,Hoja1!$K$53:$L$58,2,0)=0,IF(G156=\"F\",\"Correcte\",\"Error sexe\"),IF(VLOOKUP($D$152,Hoja1!$K$53:$L$58,2,0)<VLOOKUP(E156,Hoja1!$K$60:$L$70,2,0),\"Error edat\",\"Correcte\")))))","v":""}]
[null,null,{"$f":"IF(COUNTIF(Hoja1!A:A,B157)=1,VLOOKUP(B157,Hoja1!A:F,2,0),\"\")","v":""},null,{"$f":"IF(COUNTIF(Hoja1!A:A,B157)=1,VLOOKUP(B157,Hoja1!A:F,3,0),\"\")","v":""},{"$f":"IF(COUNTIF(Hoja1!A:A,B157)=1,VLOOKUP(B157,Hoja1!A:F,4,0),\"\")","v":""},{"$f":"IF(COUNTIF(Hoja1!A:A,B157)=1,VLOOKUP(B157,Hoja1!A:F,5,0),\"\")","v":""},{"$f":"IF(COUNTIF(Hoja1!A:A,B157)=1,VLOOKUP(B157,Hoja1!A:F,6,0),\"\")","v":""},{"$f":"IF(B157=\"\",\"\",IF(COUNTIF(Hoja1!A:A,B157)=0,\"NP erroni\",IF(COUNTIF(B:B,B157)>1,\"Inscrit/a a + d'1 equip\",IF(VLOOKUP($D$152,Hoja1!$K$53:$L$58,2,0)=0,IF(G157=\"F\",\"Correcte\",\"Error sexe\"),IF(VLOOKUP($D$152,Hoja1!$K$53:$L$58,2,0)<VLOOKUP(E157,Hoja1!$K$60:$L$70,2,0),\"Error edat\",\"Correcte\")))))","v":""}]
[null,null,{"$f":"IF(COUNTIF(Hoja1!A:A,B158)=1,VLOOKUP(B158,Hoja1!A:F,2,0),\"\")","v":""},null,{"$f":"IF(COUNTIF(Hoja1!A:A,B158)=1,VLOOKUP(B158,Hoja1!A:F,3,0),\"\")","v":""},{"$f":"IF(COUNTIF(Hoja1!A:A,B158)=1,VLOOKUP(B158,Hoja1!A:F,4,0),\"\")","v":""},{"$f":"IF(COUNTIF(Hoja1!A:A,B158)=1,VLOOKUP(B158,Hoja1!A:F,5,0),\"\")","v":""},{"$f":"IF(COUNTIF(Hoja1!A:A,B158)=1,VLOOKUP(B158,Hoja1!A:F,6,0),\"\")","v":""},{"$f":"IF(B158=\"\",\"\",IF(COUNTIF(Hoja1!A:A,B158)=0,\"NP erroni\",IF(COUNTIF(B:B,B158)>1,\"Inscrit/a a + d'1 equip\",IF(VLOOKUP($D$152,Hoja1!$K$53:$L$58,2,0)=0,IF(G158=\"F\",\"Correcte\",\"Error sexe\"),IF(VLOOKUP($D$152,Hoja1!$K$53:$L$58,2,0)<VLOOKUP(E158,Hoja1!$K$60:$L$70,2,0),\"Error edat\",\"Correcte\")))))","v":""}]
[null,null,{"$f":"IF(COUNTIF(Hoja1!A:A,B159)=1,VLOOKUP(B159,Hoja1!A:F,2,0),\"\")","v":""},null,{"$f":"IF(COUNTIF(Hoja1!A:A,B159)=1,VLOOKUP(B159,Hoja1!A:F,3,0),\"\")","v":""},{"$f":"IF(COUNTIF(Hoja1!A:A,B159)=1,VLOOKUP(B159,Hoja1!A:F,4,0),\"\")","v":""},{"$f":"IF(COUNTIF(Hoja1!A:A,B159)=1,VLOOKUP(B159,Hoja1!A:F,5,0),\"\")","v":""},{"$f":"IF(COUNTIF(Hoja1!A:A,B159)=1,VLOOKUP(B159,Hoja1!A:F,6,0),\"\")","v":""},{"$f":"IF(B159=\"\",\"\",IF(COUNTIF(Hoja1!A:A,B159)=0,\"NP erroni\",IF(COUNTIF(B:B,B159)>1,\"Inscrit/a a + d'1 equip\",IF(VLOOKUP($D$152,Hoja1!$K$53:$L$58,2,0)=0,IF(G159=\"F\",\"Correcte\",\"Error sexe\"),IF(VLOOKUP($D$152,Hoja1!$K$53:$L$58,2,0)<VLOOKUP(E159,Hoja1!$K$60:$L$70,2,0),\"Error edat\",\"Correcte\")))))","v":""}]
[null,null,{"$f":"IF(COUNTIF(Hoja1!A:A,B160)=1,VLOOKUP(B160,Hoja1!A:F,2,0),\"\")","v":""},null,{"$f":"IF(COUNTIF(Hoja1!A:A,B160)=1,VLOOKUP(B160,Hoja1!A:F,3,0),\"\")","v":""},{"$f":"IF(COUNTIF(Hoja1!A:A,B160)=1,VLOOKUP(B160,Hoja1!A:F,4,0),\"\")","v":""},{"$f":"IF(COUNTIF(Hoja1!A:A,B160)=1,VLOOKUP(B160,Hoja1!A:F,5,0),\"\")","v":""},{"$f":"IF(COUNTIF(Hoja1!A:A,B160)=1,VLOOKUP(B160,Hoja1!A:F,6,0),\"\")","v":""},{"$f":"IF(B160=\"\",\"\",IF(COUNTIF(Hoja1!A:A,B160)=0,\"NP erroni\",IF(COUNTIF(B:B,B160)>1,\"Inscrit/a a + d'1 equip\",IF(VLOOKUP($D$152,Hoja1!$K$53:$L$58,2,0)=0,IF(G160=\"F\",\"Correcte\",\"Error sexe\"),IF(VLOOKUP($D$152,Hoja1!$K$53:$L$58,2,0)<VLOOKUP(E160,Hoja1!$K$60:$L$70,2,0),\"Error edat\",\"Correcte\")))))","v":""}]
[]
[]
[null,"Inscripció equip 9",null,null,null,{"$f":"IF(AND(D167=\"\",COUNTBLANK(B171:B175)=5),\"INSCRIPCIÓ EN BLANC\",IF(COUNTBLANK(I171:I175)+COUNTIF(I171:I175,\"Correcte\")<5,\"INSCRIPCIÓ ERRÒNIA\",IF(AND(D167<>\"\",COUNTBLANK(B171:B175)<4),\"INSCRIPCIÓ COMPLETA\",\"INSCRIPCIÓ INCOMPLETA\")))","v":"INSCRIPCIÓ EN BLANC"}]
[]
[null,"Nom per defecte:",null,{"$f":"IF($B$35=\"\",\"\",$B$35&INDEX(Hoja1!$L$72:$L$86,VALUE(RIGHT(B163))))","v":""}]
[null,"Nom modificat (opcional):"]
[null,"Categoria:"]
[null,"Rànquing:",null,{"$f":"IF(COUNTBLANK(H171:H175)=5,\"\",MAX(H171:H175)+IF(COUNTBLANK(H171:H175)=4,0,LARGE(H171:H175,2)))","v":""}]
[]
[null,"NP","JUGADOR/A",null,"EDAT","CLUB","SEXE","rk tot","Error?"]
[null,null,{"$f":"IF(COUNTIF(Hoja1!A:A,B171)=1,VLOOKUP(B171,Hoja1!A:F,2,0),\"\")","v":""},null,{"$f":"IF(COUNTIF(Hoja1!A:A,B171)=1,VLOOKUP(B171,Hoja1!A:F,3,0),\"\")","v":""},{"$f":"IF(COUNTIF(Hoja1!A:A,B171)=1,VLOOKUP(B171,Hoja1!A:F,4,0),\"\")","v":""},{"$f":"IF(COUNTIF(Hoja1!A:A,B171)=1,VLOOKUP(B171,Hoja1!A:F,5,0),\"\")","v":""},{"$f":"IF(COUNTIF(Hoja1!A:A,B171)=1,VLOOKUP(B171,Hoja1!A:F,6,0),\"\")","v":""},{"$f":"IF(B171=\"\",\"\",IF(COUNTIF(Hoja1!A:A,B171)=0,\"NP erroni\",IF(COUNTIF(B:B,B171)>1,\"Inscrit/a a + d'1 equip\",IF(VLOOKUP($D$167,Hoja1!$K$53:$L$58,2,0)=0,IF(G171=\"F\",\"Correcte\",\"Error sexe\"),IF(VLOOKUP($D$167,Hoja1!$K$53:$L$58,2,0)<VLOOKUP(E171,Hoja1!$K$60:$L$70,2,0),\"Error edat\",\"Correcte\")))))","v":""}]
[null,null,{"$f":"IF(COUNTIF(Hoja1!A:A,B172)=1,VLOOKUP(B172,Hoja1!A:F,2,0),\"\")","v":""},null,{"$f":"IF(COUNTIF(Hoja1!A:A,B172)=1,VLOOKUP(B172,Hoja1!A:F,3,0),\"\")","v":""},{"$f":"IF(COUNTIF(Hoja1!A:A,B172)=1,VLOOKUP(B172,Hoja1!A:F,4,0),\"\")","v":""},{"$f":"IF(COUNTIF(Hoja1!A:A,B172)=1,VLOOKUP(B172,Hoja1!A:F,5,0),\"\")","v":""},{"$f":"IF(COUNTIF(Hoja1!A:A,B172)=1,VLOOKUP(B172,Hoja1!A:F,6,0),\"\")","v":""},{"$f":"IF(B172=\"\",\"\",IF(COUNTIF(Hoja1!A:A,B172)=0,\"NP erroni\",IF(COUNTIF(B:B,B172)>1,\"Inscrit/a a + d'1 equip\",IF(VLOOKUP($D$167,Hoja1!$K$53:$L$58,2,0)=0,IF(G172=\"F\",\"Correcte\",\"Error sexe\"),IF(VLOOKUP($D$167,Hoja1!$K$53:$L$58,2,0)<VLOOKUP(E172,Hoja1!$K$60:$L$70,2,0),\"Error edat\",\"Correcte\")))))","v":""}]
[null,null,{"$f":"IF(COUNTIF(Hoja1!A:A,B173)=1,VLOOKUP(B173,Hoja1!A:F,2,0),\"\")","v":""},null,{"$f":"IF(COUNTIF(Hoja1!A:A,B173)=1,VLOOKUP(B173,Hoja1!A:F,3,0),\"\")","v":""},{"$f":"IF(COUNTIF(Hoja1!A:A,B173)=1,VLOOKUP(B173,Hoja1!A:F,4,0),\"\")","v":""},{"$f":"IF(COUNTIF(Hoja1!A:A,B173)=1,VLOOKUP(B173,Hoja1!A:F,5,0),\"\")","v":""},{"$f":"IF(COUNTIF(Hoja1!A:A,B173)=1,VLOOKUP(B173,Hoja1!A:F,6,0),\"\")","v":""},{"$f":"IF(B173=\"\",\"\",IF(COUNTIF(Hoja1!A:A,B173)=0,\"NP erroni\",IF(COUNTIF(B:B,B173)>1,\"Inscrit/a a + d'1 equip\",IF(VLOOKUP($D$167,Hoja1!$K$53:$L$58,2,0)=0,IF(G173=\"F\",\"Correcte\",\"Error sexe\"),IF(VLOOKUP($D$167,Hoja1!$K$53:$L$58,2,0)<VLOOKUP(E173,Hoja1!$K$60:$L$70,2,0),\"Error edat\",\"Correcte\")))))","v":""}]
[null,null,{"$f":"IF(COUNTIF(Hoja1!A:A,B174)=1,VLOOKUP(B174,Hoja1!A:F,2,0),\"\")","v":""},null,{"$f":"IF(COUNTIF(Hoja1!A:A,B174)=1,VLOOKUP(B174,Hoja1!A:F,3,0),\"\")","v":""},{"$f":"IF(COUNTIF(Hoja1!A:A,B174)=1,VLOOKUP(B174,Hoja1!A:F,4,0),\"\")","v":""},{"$f":"IF(COUNTIF(Hoja1!A:A,B174)=1,VLOOKUP(B174,Hoja1!A:F,5,0),\"\")","v":""},{"$f":"IF(COUNTIF(Hoja1!A:A,B174)=1,VLOOKUP(B174,Hoja1!A:F,6,0),\"\")","v":""},{"$f":"IF(B174=\"\",\"\",IF(COUNTIF(Hoja1!A:A,B174)=0,\"NP erroni\",IF(COUNTIF(B:B,B174)>1,\"Inscrit/a a + d'1 equip\",IF(VLOOKUP($D$167,Hoja1!$K$53:$L$58,2,0)=0,IF(G174=\"F\",\"Correcte\",\"Error sexe\"),IF(VLOOKUP($D$167,Hoja1!$K$53:$L$58,2,0)<VLOOKUP(E174,Hoja1!$K$60:$L$70,2,0),\"Error edat\",\"Correcte\")))))","v":""}]
[null,null,{"$f":"IF(COUNTIF(Hoja1!A:A,B175)=1,VLOOKUP(B175,Hoja1!A:F,2,0),\"\")","v":""},null,{"$f":"IF(COUNTIF(Hoja1!A:A,B175)=1,VLOOKUP(B175,Hoja1!A:F,3,0),\"\")","v":""},{"$f":"IF(COUNTIF(Hoja1!A:A,B175)=1,VLOOKUP(B175,Hoja1!A:F,4,0),\"\")","v":""},{"$f":"IF(COUNTIF(Hoja1!A:A,B175)=1,VLOOKUP(B175,Hoja1!A:F,5,0),\"\")","v":""},{"$f":"IF(COUNTIF(Hoja1!A:A,B175)=1,VLOOKUP(B175,Hoja1!A:F,6,0),\"\")","v":""},{"$f":"IF(B175=\"\",\"\",IF(COUNTIF(Hoja1!A:A,B175)=0,\"NP erroni\",IF(COUNTIF(B:B,B175)>1,\"Inscrit/a a + d'1 equip\",IF(VLOOKUP($D$167,Hoja1!$K$53:$L$58,2,0)=0,IF(G175=\"F\",\"Correcte\",\"Error sexe\"),IF(VLOOKUP($D$167,Hoja1!$K$53:$L$58,2,0)<VLOOKUP(E175,Hoja1!$K$60:$L$70,2,0),\"Error edat\",\"Correcte\")))))","v":""}]
[]
[]
[null,"Inscripció equip 10",null,null,null,{"$f":"IF(AND(D182=\"\",COUNTBLANK(B186:B190)=5),\"INSCRIPCIÓ EN BLANC\",IF(COUNTBLANK(I186:I190)+COUNTIF(I186:I190,\"Correcte\")<5,\"INSCRIPCIÓ ERRÒNIA\",IF(AND(D182<>\"\",COUNTBLANK(B186:B190)<4),\"INSCRIPCIÓ COMPLETA\",\"INSCRIPCIÓ INCOMPLETA\")))","v":"INSCRIPCIÓ EN BLANC"}]
[]
[null,"Nom per defecte:",null,{"$f":"IF($B$35=\"\",\"\",$B$35&INDEX(Hoja1!$L$72:$L$86,VALUE(RIGHT(B178,2))))","v":""}]
[null,"Nom modificat (opcional):"]
[null,"Categoria:"]
[null,"Rànquing:",null,{"$f":"IF(COUNTBLANK(H186:H190)=5,\"\",MAX(H186:H190)+IF(COUNTBLANK(H186:H190)=4,0,LARGE(H186:H190,2)))","v":""}]
[]
[null,"NP","JUGADOR/A",null,"EDAT","CLUB","SEXE","rk tot","Error?"]
[null,null,{"$f":"IF(COUNTIF(Hoja1!A:A,B186)=1,VLOOKUP(B186,Hoja1!A:F,2,0),\"\")","v":""},null,{"$f":"IF(COUNTIF(Hoja1!A:A,B186)=1,VLOOKUP(B186,Hoja1!A:F,3,0),\"\")","v":""},{"$f":"IF(COUNTIF(Hoja1!A:A,B186)=1,VLOOKUP(B186,Hoja1!A:F,4,0),\"\")","v":""},{"$f":"IF(COUNTIF(Hoja1!A:A,B186)=1,VLOOKUP(B186,Hoja1!A:F,5,0),\"\")","v":""},{"$f":"IF(COUNTIF(Hoja1!A:A,B186)=1,VLOOKUP(B186,Hoja1!A:F,6,0),\"\")","v":""},{"$f":"IF(B186=\"\",\"\",IF(COUNTIF(Hoja1!A:A,B186)=0,\"NP erroni\",IF(COUNTIF(B:B,B186)>1,\"Inscrit/a a + d'1 equip\",IF(VLOOKUP($D$182,Hoja1!$K$53:$L$58,2,0)=0,IF(G186=\"F\",\"Correcte\",\"Error sexe\"),IF(VLOOKUP($D$182,Hoja1!$K$53:$L$58,2,0)<VLOOKUP(E186,Hoja1!$K$60:$L$70,2,0),\"Error edat\",\"Correcte\")))))","v":""}]
[null,null,{"$f":"IF(COUNTIF(Hoja1!A:A,B187)=1,VLOOKUP(B187,Hoja1!A:F,2,0),\"\")","v":""},null,{"$f":"IF(COUNTIF(Hoja1!A:A,B187)=1,VLOOKUP(B187,Hoja1!A:F,3,0),\"\")","v":""},{"$f":"IF(COUNTIF(Hoja1!A:A,B187)=1,VLOOKUP(B187,Hoja1!A:F,4,0),\"\")","v":""},{"$f":"IF(COUNTIF(Hoja1!A:A,B187)=1,VLOOKUP(B187,Hoja1!A:F,5,0),\"\")","v":""},{"$f":"IF(COUNTIF(Hoja1!A:A,B187)=1,VLOOKUP(B187,Hoja1!A:F,6,0),\"\")","v":""},{"$f":"IF(B187=\"\",\"\",IF(COUNTIF(Hoja1!A:A,B187)=0,\"NP erroni\",IF(COUNTIF(B:B,B187)>1,\"Inscrit/a a + d'1 equip\",IF(VLOOKUP($D$182,Hoja1!$K$53:$L$58,2,0)=0,IF(G187=\"F\",\"Correcte\",\"Error sexe\"),IF(VLOOKUP($D$182,Hoja1!$K$53:$L$58,2,0)<VLOOKUP(E187,Hoja1!$K$60:$L$70,2,0),\"Error edat\",\"Correcte\")))))","v":""}]
[null,null,{"$f":"IF(COUNTIF(Hoja1!A:A,B188)=1,VLOOKUP(B188,Hoja1!A:F,2,0),\"\")","v":""},null,{"$f":"IF(COUNTIF(Hoja1!A:A,B188)=1,VLOOKUP(B188,Hoja1!A:F,3,0),\"\")","v":""},{"$f":"IF(COUNTIF(Hoja1!A:A,B188)=1,VLOOKUP(B188,Hoja1!A:F,4,0),\"\")","v":""},{"$f":"IF(COUNTIF(Hoja1!A:A,B188)=1,VLOOKUP(B188,Hoja1!A:F,5,0),\"\")","v":""},{"$f":"IF(COUNTIF(Hoja1!A:A,B188)=1,VLOOKUP(B188,Hoja1!A:F,6,0),\"\")","v":""},{"$f":"IF(B188=\"\",\"\",IF(COUNTIF(Hoja1!A:A,B188)=0,\"NP erroni\",IF(COUNTIF(B:B,B188)>1,\"Inscrit/a a + d'1 equip\",IF(VLOOKUP($D$182,Hoja1!$K$53:$L$58,2,0)=0,IF(G188=\"F\",\"Correcte\",\"Error sexe\"),IF(VLOOKUP($D$182,Hoja1!$K$53:$L$58,2,0)<VLOOKUP(E188,Hoja1!$K$60:$L$70,2,0),\"Error edat\",\"Correcte\")))))","v":""}]
[null,null,{"$f":"IF(COUNTIF(Hoja1!A:A,B189)=1,VLOOKUP(B189,Hoja1!A:F,2,0),\"\")","v":""},null,{"$f":"IF(COUNTIF(Hoja1!A:A,B189)=1,VLOOKUP(B189,Hoja1!A:F,3,0),\"\")","v":""},{"$f":"IF(COUNTIF(Hoja1!A:A,B189)=1,VLOOKUP(B189,Hoja1!A:F,4,0),\"\")","v":""},{"$f":"IF(COUNTIF(Hoja1!A:A,B189)=1,VLOOKUP(B189,Hoja1!A:F,5,0),\"\")","v":""},{"$f":"IF(COUNTIF(Hoja1!A:A,B189)=1,VLOOKUP(B189,Hoja1!A:F,6,0),\"\")","v":""},{"$f":"IF(B189=\"\",\"\",IF(COUNTIF(Hoja1!A:A,B189)=0,\"NP erroni\",IF(COUNTIF(B:B,B189)>1,\"Inscrit/a a + d'1 equip\",IF(VLOOKUP($D$182,Hoja1!$K$53:$L$58,2,0)=0,IF(G189=\"F\",\"Correcte\",\"Error sexe\"),IF(VLOOKUP($D$182,Hoja1!$K$53:$L$58,2,0)<VLOOKUP(E189,Hoja1!$K$60:$L$70,2,0),\"Error edat\",\"Correcte\")))))","v":""}]
[null,null,{"$f":"IF(COUNTIF(Hoja1!A:A,B190)=1,VLOOKUP(B190,Hoja1!A:F,2,0),\"\")","v":""},null,{"$f":"IF(COUNTIF(Hoja1!A:A,B190)=1,VLOOKUP(B190,Hoja1!A:F,3,0),\"\")","v":""},{"$f":"IF(COUNTIF(Hoja1!A:A,B190)=1,VLOOKUP(B190,Hoja1!A:F,4,0),\"\")","v":""},{"$f":"IF(COUNTIF(Hoja1!A:A,B190)=1,VLOOKUP(B190,Hoja1!A:F,5,0),\"\")","v":""},{"$f":"IF(COUNTIF(Hoja1!A:A,B190)=1,VLOOKUP(B190,Hoja1!A:F,6,0),\"\")","v":""},{"$f":"IF(B190=\"\",\"\",IF(COUNTIF(Hoja1!A:A,B190)=0,\"NP erroni\",IF(COUNTIF(B:B,B190)>1,\"Inscrit/a a + d'1 equip\",IF(VLOOKUP($D$182,Hoja1!$K$53:$L$58,2,0)=0,IF(G190=\"F\",\"Correcte\",\"Error sexe\"),IF(VLOOKUP($D$182,Hoja1!$K$53:$L$58,2,0)<VLOOKUP(E190,Hoja1!$K$60:$L$70,2,0),\"Error edat\",\"Correcte\")))))","v":""}]
[]
[]
[null,"Inscripció equip 11",null,null,null,{"$f":"IF(AND(D197=\"\",COUNTBLANK(B201:B205)=5),\"INSCRIPCIÓ EN BLANC\",IF(COUNTBLANK(I201:I205)+COUNTIF(I201:I205,\"Correcte\")<5,\"INSCRIPCIÓ ERRÒNIA\",IF(AND(D197<>\"\",COUNTBLANK(B201:B205)<4),\"INSCRIPCIÓ COMPLETA\",\"INSCRIPCIÓ INCOMPLETA\")))","v":"INSCRIPCIÓ EN BLANC"}]
[]
[null,"Nom per defecte:",null,{"$f":"IF($B$35=\"\",\"\",$B$35&INDEX(Hoja1!$L$72:$L$86,VALUE(RIGHT(B193,2))))","v":""}]
[null,"Nom modificat (opcional):"]
[null,"Categoria:"]
[null,"Rànquing:",null,{"$f":"IF(COUNTBLANK(H201:H205)=5,\"\",MAX(H201:H205)+IF(COUNTBLANK(H201:H205)=4,0,LARGE(H201:H205,2)))","v":""}]
[]
[null,"NP","JUGADOR/A",null,"EDAT","CLUB","SEXE","rk tot","Error?"]
[null,null,{"$f":"IF(COUNTIF(Hoja1!A:A,B201)=1,VLOOKUP(B201,Hoja1!A:F,2,0),\"\")","v":""},null,{"$f":"IF(COUNTIF(Hoja1!A:A,B201)=1,VLOOKUP(B201,Hoja1!A:F,3,0),\"\")","v":""},{"$f":"IF(COUNTIF(Hoja1!A:A,B201)=1,VLOOKUP(B201,Hoja1!A:F,4,0),\"\")","v":""},{"$f":"IF(COUNTIF(Hoja1!A:A,B201)=1,VLOOKUP(B201,Hoja1!A:F,5,0),\"\")","v":""},{"$f":"IF(COUNTIF(Hoja1!A:A,B201)=1,VLOOKUP(B201,Hoja1!A:F,6,0),\"\")","v":""},{"$f":"IF(B201=\"\",\"\",IF(COUNTIF(Hoja1!A:A,B201)=0,\"NP erroni\",IF(COUNTIF(B:B,B201)>1,\"Inscrit/a a + d'1 equip\",IF(VLOOKUP($D$197,Hoja1!$K$53:$L$58,2,0)=0,IF(G201=\"F\",\"Correcte\",\"Error sexe\"),IF(VLOOKUP($D$197,Hoja1!$K$53:$L$58,2,0)<VLOOKUP(E201,Hoja1!$K$60:$L$70,2,0),\"Error edat\",\"Correcte\")))))","v":""}]
[null,null,{"$f":"IF(COUNTIF(Hoja1!A:A,B202)=1,VLOOKUP(B202,Hoja1!A:F,2,0),\"\")","v":""},null,{"$f":"IF(COUNTIF(Hoja1!A:A,B202)=1,VLOOKUP(B202,Hoja1!A:F,3,0),\"\")","v":""},{"$f":"IF(COUNTIF(Hoja1!A:A,B202)=1,VLOOKUP(B202,Hoja1!A:F,4,0),\"\")","v":""},{"$f":"IF(COUNTIF(Hoja1!A:A,B202)=1,VLOOKUP(B202,Hoja1!A:F,5,0),\"\")","v":""},{"$f":"IF(COUNTIF(Hoja1!A:A,B202)=1,VLOOKUP(B202,Hoja1!A:F,6,0),\"\")","v":""},{"$f":"IF(B202=\"\",\"\",IF(COUNTIF(Hoja1!A:A,B202)=0,\"NP erroni\",IF(COUNTIF(B:B,B202)>1,\"Inscrit/a a + d'1 equip\",IF(VLOOKUP($D$197,Hoja1!$K$53:$L$58,2,0)=0,IF(G202=\"F\",\"Correcte\",\"Error sexe\"),IF(VLOOKUP($D$197,Hoja1!$K$53:$L$58,2,0)<VLOOKUP(E202,Hoja1!$K$60:$L$70,2,0),\"Error edat\",\"Correcte\")))))","v":""}]
[null,null,{"$f":"IF(COUNTIF(Hoja1!A:A,B203)=1,VLOOKUP(B203,Hoja1!A:F,2,0),\"\")","v":""},null,{"$f":"IF(COUNTIF(Hoja1!A:A,B203)=1,VLOOKUP(B203,Hoja1!A:F,3,0),\"\")","v":""},{"$f":"IF(COUNTIF(Hoja1!A:A,B203)=1,VLOOKUP(B203,Hoja1!A:F,4,0),\"\")","v":""},{"$f":"IF(COUNTIF(Hoja1!A:A,B203)=1,VLOOKUP(B203,Hoja1!A:F,5,0),\"\")","v":""},{"$f":"IF(COUNTIF(Hoja1!A:A,B203)=1,VLOOKUP(B203,Hoja1!A:F,6,0),\"\")","v":""},{"$f":"IF(B203=\"\",\"\",IF(COUNTIF(Hoja1!A:A,B203)=0,\"NP erroni\",IF(COUNTIF(B:B,B203)>1,\"Inscrit/a a + d'1 equip\",IF(VLOOKUP($D$197,Hoja1!$K$53:$L$58,2,0)=0,IF(G203=\"F\",\"Correcte\",\"Error sexe\"),IF(VLOOKUP($D$197,Hoja1!$K$53:$L$58,2,0)<VLOOKUP(E203,Hoja1!$K$60:$L$70,2,0),\"Error edat\",\"Correcte\")))))","v":""}]
[null,null,{"$f":"IF(COUNTIF(Hoja1!A:A,B204)=1,VLOOKUP(B204,Hoja1!A:F,2,0),\"\")","v":""},null,{"$f":"IF(COUNTIF(Hoja1!A:A,B204)=1,VLOOKUP(B204,Hoja1!A:F,3,0),\"\")","v":""},{"$f":"IF(COUNTIF(Hoja1!A:A,B204)=1,VLOOKUP(B204,Hoja1!A:F,4,0),\"\")","v":""},{"$f":"IF(COUNTIF(Hoja1!A:A,B204)=1,VLOOKUP(B204,Hoja1!A:F,5,0),\"\")","v":""},{"$f":"IF(COUNTIF(Hoja1!A:A,B204)=1,VLOOKUP(B204,Hoja1!A:F,6,0),\"\")","v":""},{"$f":"IF(B204=\"\",\"\",IF(COUNTIF(Hoja1!A:A,B204)=0,\"NP erroni\",IF(COUNTIF(B:B,B204)>1,\"Inscrit/a a + d'1 equip\",IF(VLOOKUP($D$197,Hoja1!$K$53:$L$58,2,0)=0,IF(G204=\"F\",\"Correcte\",\"Error sexe\"),IF(VLOOKUP($D$197,Hoja1!$K$53:$L$58,2,0)<VLOOKUP(E204,Hoja1!$K$60:$L$70,2,0),\"Error edat\",\"Correcte\")))))","v":""}]
[null,null,{"$f":"IF(COUNTIF(Hoja1!A:A,B205)=1,VLOOKUP(B205,Hoja1!A:F,2,0),\"\")","v":""},null,{"$f":"IF(COUNTIF(Hoja1!A:A,B205)=1,VLOOKUP(B205,Hoja1!A:F,3,0),\"\")","v":""},{"$f":"IF(COUNTIF(Hoja1!A:A,B205)=1,VLOOKUP(B205,Hoja1!A:F,4,0),\"\")","v":""},{"$f":"IF(COUNTIF(Hoja1!A:A,B205)=1,VLOOKUP(B205,Hoja1!A:F,5,0),\"\")","v":""},{"$f":"IF(COUNTIF(Hoja1!A:A,B205)=1,VLOOKUP(B205,Hoja1!A:F,6,0),\"\")","v":""},{"$f":"IF(B205=\"\",\"\",IF(COUNTIF(Hoja1!A:A,B205)=0,\"NP erroni\",IF(COUNTIF(B:B,B205)>1,\"Inscrit/a a + d'1 equip\",IF(VLOOKUP($D$197,Hoja1!$K$53:$L$58,2,0)=0,IF(G205=\"F\",\"Correcte\",\"Error sexe\"),IF(VLOOKUP($D$197,Hoja1!$K$53:$L$58,2,0)<VLOOKUP(E205,Hoja1!$K$60:$L$70,2,0),\"Error edat\",\"Correcte\")))))","v":""}]
[]
[]
[null,"Inscripció equip 12",null,null,null,{"$f":"IF(AND(D212=\"\",COUNTBLANK(B216:B220)=5),\"INSCRIPCIÓ EN BLANC\",IF(COUNTBLANK(I216:I220)+COUNTIF(I216:I220,\"Correcte\")<5,\"INSCRIPCIÓ ERRÒNIA\",IF(AND(D212<>\"\",COUNTBLANK(B216:B220)<4),\"INSCRIPCIÓ COMPLETA\",\"INSCRIPCIÓ INCOMPLETA\")))","v":"INSCRIPCIÓ EN BLANC"}]
[]
[null,"Nom per defecte:",null,{"$f":"IF($B$35=\"\",\"\",$B$35&INDEX(Hoja1!$L$72:$L$86,VALUE(RIGHT(B208,2))))","v":""}]
[null,"Nom modificat (opcional):"]
[null,"Categoria:"]
[null,"Rànquing:",null,{"$f":"IF(COUNTBLANK(H216:H220)=5,\"\",MAX(H216:H220)+IF(COUNTBLANK(H216:H220)=4,0,LARGE(H216:H220,2)))","v":""}]
[]
[null,"NP","JUGADOR/A",null,"EDAT","CLUB","SEXE","rk tot","Error?"]
[null,null,{"$f":"IF(COUNTIF(Hoja1!A:A,B216)=1,VLOOKUP(B216,Hoja1!A:F,2,0),\"\")","v":""},null,{"$f":"IF(COUNTIF(Hoja1!A:A,B216)=1,VLOOKUP(B216,Hoja1!A:F,3,0),\"\")","v":""},{"$f":"IF(COUNTIF(Hoja1!A:A,B216)=1,VLOOKUP(B216,Hoja1!A:F,4,0),\"\")","v":""},{"$f":"IF(COUNTIF(Hoja1!A:A,B216)=1,VLOOKUP(B216,Hoja1!A:F,5,0),\"\")","v":""},{"$f":"IF(COUNTIF(Hoja1!A:A,B216)=1,VLOOKUP(B216,Hoja1!A:F,6,0),\"\")","v":""},{"$f":"IF(B216=\"\",\"\",IF(COUNTIF(Hoja1!A:A,B216)=0,\"NP erroni\",IF(COUNTIF(B:B,B216)>1,\"Inscrit/a a + d'1 equip\",IF(VLOOKUP($D$212,Hoja1!$K$53:$L$58,2,0)=0,IF(G216=\"F\",\"Correcte\",\"Error sexe\"),IF(VLOOKUP($D$212,Hoja1!$K$53:$L$58,2,0)<VLOOKUP(E216,Hoja1!$K$60:$L$70,2,0),\"Error edat\",\"Correcte\")))))","v":""}]
[null,null,{"$f":"IF(COUNTIF(Hoja1!A:A,B217)=1,VLOOKUP(B217,Hoja1!A:F,2,0),\"\")","v":""},null,{"$f":"IF(COUNTIF(Hoja1!A:A,B217)=1,VLOOKUP(B217,Hoja1!A:F,3,0),\"\")","v":""},{"$f":"IF(COUNTIF(Hoja1!A:A,B217)=1,VLOOKUP(B217,Hoja1!A:F,4,0),\"\")","v":""},{"$f":"IF(COUNTIF(Hoja1!A:A,B217)=1,VLOOKUP(B217,Hoja1!A:F,5,0),\"\")","v":""},{"$f":"IF(COUNTIF(Hoja1!A:A,B217)=1,VLOOKUP(B217,Hoja1!A:F,6,0),\"\")","v":""},{"$f":"IF(B217=\"\",\"\",IF(COUNTIF(Hoja1!A:A,B217)=0,\"NP erroni\",IF(COUNTIF(B:B,B217)>1,\"Inscrit/a a + d'1 equip\",IF(VLOOKUP($D$212,Hoja1!$K$53:$L$58,2,0)=0,IF(G217=\"F\",\"Correcte\",\"Error sexe\"),IF(VLOOKUP($D$212,Hoja1!$K$53:$L$58,2,0)<VLOOKUP(E217,Hoja1!$K$60:$L$70,2,0),\"Error edat\",\"Correcte\")))))","v":""}]
[null,null,{"$f":"IF(COUNTIF(Hoja1!A:A,B218)=1,VLOOKUP(B218,Hoja1!A:F,2,0),\"\")","v":""},null,{"$f":"IF(COUNTIF(Hoja1!A:A,B218)=1,VLOOKUP(B218,Hoja1!A:F,3,0),\"\")","v":""},{"$f":"IF(COUNTIF(Hoja1!A:A,B218)=1,VLOOKUP(B218,Hoja1!A:F,4,0),\"\")","v":""},{"$f":"IF(COUNTIF(Hoja1!A:A,B218)=1,VLOOKUP(B218,Hoja1!A:F,5,0),\"\")","v":""},{"$f":"IF(COUNTIF(Hoja1!A:A,B218)=1,VLOOKUP(B218,Hoja1!A:F,6,0),\"\")","v":""},{"$f":"IF(B218=\"\",\"\",IF(COUNTIF(Hoja1!A:A,B218)=0,\"NP erroni\",IF(COUNTIF(B:B,B218)>1,\"Inscrit/a a + d'1 equip\",IF(VLOOKUP($D$212,Hoja1!$K$53:$L$58,2,0)=0,IF(G218=\"F\",\"Correcte\",\"Error sexe\"),IF(VLOOKUP($D$212,Hoja1!$K$53:$L$58,2,0)<VLOOKUP(E218,Hoja1!$K$60:$L$70,2,0),\"Error edat\",\"Correcte\")))))","v":""}]
[null,null,{"$f":"IF(COUNTIF(Hoja1!A:A,B219)=1,VLOOKUP(B219,Hoja1!A:F,2,0),\"\")","v":""},null,{"$f":"IF(COUNTIF(Hoja1!A:A,B219)=1,VLOOKUP(B219,Hoja1!A:F,3,0),\"\")","v":""},{"$f":"IF(COUNTIF(Hoja1!A:A,B219)=1,VLOOKUP(B219,Hoja1!A:F,4,0),\"\")","v":""},{"$f":"IF(COUNTIF(Hoja1!A:A,B219)=1,VLOOKUP(B219,Hoja1!A:F,5,0),\"\")","v":""},{"$f":"IF(COUNTIF(Hoja1!A:A,B219)=1,VLOOKUP(B219,Hoja1!A:F,6,0),\"\")","v":""},{"$f":"IF(B219=\"\",\"\",IF(COUNTIF(Hoja1!A:A,B219)=0,\"NP erroni\",IF(COUNTIF(B:B,B219)>1,\"Inscrit/a a + d'1 equip\",IF(VLOOKUP($D$212,Hoja1!$K$53:$L$58,2,0)=0,IF(G219=\"F\",\"Correcte\",\"Error sexe\"),IF(VLOOKUP($D$212,Hoja1!$K$53:$L$58,2,0)<VLOOKUP(E219,Hoja1!$K$60:$L$70,2,0),\"Error edat\",\"Correcte\")))))","v":""}]
[null,null,{"$f":"IF(COUNTIF(Hoja1!A:A,B220)=1,VLOOKUP(B220,Hoja1!A:F,2,0),\"\")","v":""},null,{"$f":"IF(COUNTIF(Hoja1!A:A,B220)=1,VLOOKUP(B220,Hoja1!A:F,3,0),\"\")","v":""},{"$f":"IF(COUNTIF(Hoja1!A:A,B220)=1,VLOOKUP(B220,Hoja1!A:F,4,0),\"\")","v":""},{"$f":"IF(COUNTIF(Hoja1!A:A,B220)=1,VLOOKUP(B220,Hoja1!A:F,5,0),\"\")","v":""},{"$f":"IF(COUNTIF(Hoja1!A:A,B220)=1,VLOOKUP(B220,Hoja1!A:F,6,0),\"\")","v":""},{"$f":"IF(B220=\"\",\"\",IF(COUNTIF(Hoja1!A:A,B220)=0,\"NP erroni\",IF(COUNTIF(B:B,B220)>1,\"Inscrit/a a + d'1 equip\",IF(VLOOKUP($D$212,Hoja1!$K$53:$L$58,2,0)=0,IF(G220=\"F\",\"Correcte\",\"Error sexe\"),IF(VLOOKUP($D$212,Hoja1!$K$53:$L$58,2,0)<VLOOKUP(E220,Hoja1!$K$60:$L$70,2,0),\"Error edat\",\"Correcte\")))))","v":""}]
[]
[]
[null,"Inscripció equip 13",null,null,null,{"$f":"IF(AND(D227=\"\",COUNTBLANK(B231:B235)=5),\"INSCRIPCIÓ EN BLANC\",IF(COUNTBLANK(I231:I235)+COUNTIF(I231:I235,\"Correcte\")<5,\"INSCRIPCIÓ ERRÒNIA\",IF(AND(D227<>\"\",COUNTBLANK(B231:B235)<4),\"INSCRIPCIÓ COMPLETA\",\"INSCRIPCIÓ INCOMPLETA\")))","v":"INSCRIPCIÓ EN BLANC"}]
[]
[null,"Nom per defecte:",null,{"$f":"IF($B$35=\"\",\"\",$B$35&INDEX(Hoja1!$L$72:$L$86,VALUE(RIGHT(B223,2))))","v":""}]
[null,"Nom modificat (opcional):"]
[null,"Categoria:"]
[null,"Rànquing:",null,{"$f":"IF(COUNTBLANK(H231:H235)=5,\"\",MAX(H231:H235)+IF(COUNTBLANK(H231:H235)=4,0,LARGE(H231:H235,2)))","v":""}]
[]
[null,"NP","JUGADOR/A",null,"EDAT","CLUB","SEXE","rk tot","Error?"]
[null,null,{"$f":"IF(COUNTIF(Hoja1!A:A,B231)=1,VLOOKUP(B231,Hoja1!A:F,2,0),\"\")","v":""},null,{"$f":"IF(COUNTIF(Hoja1!A:A,B231)=1,VLOOKUP(B231,Hoja1!A:F,3,0),\"\")","v":""},{"$f":"IF(COUNTIF(Hoja1!A:A,B231)=1,VLOOKUP(B231,Hoja1!A:F,4,0),\"\")","v":""},{"$f":"IF(COUNTIF(Hoja1!A:A,B231)=1,VLOOKUP(B231,Hoja1!A:F,5,0),\"\")","v":""},{"$f":"IF(COUNTIF(Hoja1!A:A,B231)=1,VLOOKUP(B231,Hoja1!A:F,6,0),\"\")","v":""},{"$f":"IF(B231=\"\",\"\",IF(COUNTIF(Hoja1!A:A,B231)=0,\"NP erroni\",IF(COUNTIF(B:B,B231)>1,\"Inscrit/a a + d'1 equip\",IF(VLOOKUP($D$227,Hoja1!$K$53:$L$58,2,0)=0,IF(G231=\"F\",\"Correcte\",\"Error sexe\"),IF(VLOOKUP($D$227,Hoja1!$K$53:$L$58,2,0)<VLOOKUP(E231,Hoja1!$K$60:$L$70,2,0),\"Error edat\",\"Correcte\")))))","v":""}]
[null,null,{"$f":"IF(COUNTIF(Hoja1!A:A,B232)=1,VLOOKUP(B232,Hoja1!A:F,2,0),\"\")","v":""},null,{"$f":"IF(COUNTIF(Hoja1!A:A,B232)=1,VLOOKUP(B232,Hoja1!A:F,3,0),\"\")","v":""},{"$f":"IF(COUNTIF(Hoja1!A:A,B232)=1,VLOOKUP(B232,Hoja1!A:F,4,0),\"\")","v":""},{"$f":"IF(COUNTIF(Hoja1!A:A,B232)=1,VLOOKUP(B232,Hoja1!A:F,5,0),\"\")","v":""},{"$f":"IF(COUNTIF(Hoja1!A:A,B232)=1,VLOOKUP(B232,Hoja1!A:F,6,0),\"\")","v":""},{"$f":"IF(B232=\"\",\"\",IF(COUNTIF(Hoja1!A:A,B232)=0,\"NP erroni\",IF(COUNTIF(B:B,B232)>1,\"Inscrit/a a + d'1 equip\",IF(VLOOKUP($D$227,Hoja1!$K$53:$L$58,2,0)=0,IF(G232=\"F\",\"Correcte\",\"Error sexe\"),IF(VLOOKUP($D$227,Hoja1!$K$53:$L$58,2,0)<VLOOKUP(E232,Hoja1!$K$60:$L$70,2,0),\"Error edat\",\"Correcte\")))))","v":""}]
[null,null,{"$f":"IF(COUNTIF(Hoja1!A:A,B233)=1,VLOOKUP(B233,Hoja1!A:F,2,0),\"\")","v":""},null,{"$f":"IF(COUNTIF(Hoja1!A:A,B233)=1,VLOOKUP(B233,Hoja1!A:F,3,0),\"\")","v":""},{"$f":"IF(COUNTIF(Hoja1!A:A,B233)=1,VLOOKUP(B233,Hoja1!A:F,4,0),\"\")","v":""},{"$f":"IF(COUNTIF(Hoja1!A:A,B233)=1,VLOOKUP(B233,Hoja1!A:F,5,0),\"\")","v":""},{"$f":"IF(COUNTIF(Hoja1!A:A,B233)=1,VLOOKUP(B233,Hoja1!A:F,6,0),\"\")","v":""},{"$f":"IF(B233=\"\",\"\",IF(COUNTIF(Hoja1!A:A,B233)=0,\"NP erroni\",IF(COUNTIF(B:B,B233)>1,\"Inscrit/a a + d'1 equip\",IF(VLOOKUP($D$227,Hoja1!$K$53:$L$58,2,0)=0,IF(G233=\"F\",\"Correcte\",\"Error sexe\"),IF(VLOOKUP($D$227,Hoja1!$K$53:$L$58,2,0)<VLOOKUP(E233,Hoja1!$K$60:$L$70,2,0),\"Error edat\",\"Correcte\")))))","v":""}]
[null,null,{"$f":"IF(COUNTIF(Hoja1!A:A,B234)=1,VLOOKUP(B234,Hoja1!A:F,2,0),\"\")","v":""},null,{"$f":"IF(COUNTIF(Hoja1!A:A,B234)=1,VLOOKUP(B234,Hoja1!A:F,3,0),\"\")","v":""},{"$f":"IF(COUNTIF(Hoja1!A:A,B234)=1,VLOOKUP(B234,Hoja1!A:F,4,0),\"\")","v":""},{"$f":"IF(COUNTIF(Hoja1!A:A,B234)=1,VLOOKUP(B234,Hoja1!A:F,5,0),\"\")","v":""},{"$f":"IF(COUNTIF(Hoja1!A:A,B234)=1,VLOOKUP(B234,Hoja1!A:F,6,0),\"\")","v":""},{"$f":"IF(B234=\"\",\"\",IF(COUNTIF(Hoja1!A:A,B234)=0,\"NP erroni\",IF(COUNTIF(B:B,B234)>1,\"Inscrit/a a + d'1 equip\",IF(VLOOKUP($D$227,Hoja1!$K$53:$L$58,2,0)=0,IF(G234=\"F\",\"Correcte\",\"Error sexe\"),IF(VLOOKUP($D$227,Hoja1!$K$53:$L$58,2,0)<VLOOKUP(E234,Hoja1!$K$60:$L$70,2,0),\"Error edat\",\"Correcte\")))))","v":""}]
[null,null,{"$f":"IF(COUNTIF(Hoja1!A:A,B235)=1,VLOOKUP(B235,Hoja1!A:F,2,0),\"\")","v":""},null,{"$f":"IF(COUNTIF(Hoja1!A:A,B235)=1,VLOOKUP(B235,Hoja1!A:F,3,0),\"\")","v":""},{"$f":"IF(COUNTIF(Hoja1!A:A,B235)=1,VLOOKUP(B235,Hoja1!A:F,4,0),\"\")","v":""},{"$f":"IF(COUNTIF(Hoja1!A:A,B235)=1,VLOOKUP(B235,Hoja1!A:F,5,0),\"\")","v":""},{"$f":"IF(COUNTIF(Hoja1!A:A,B235)=1,VLOOKUP(B235,Hoja1!A:F,6,0),\"\")","v":""},{"$f":"IF(B235=\"\",\"\",IF(COUNTIF(Hoja1!A:A,B235)=0,\"NP erroni\",IF(COUNTIF(B:B,B235)>1,\"Inscrit/a a + d'1 equip\",IF(VLOOKUP($D$227,Hoja1!$K$53:$L$58,2,0)=0,IF(G235=\"F\",\"Correcte\",\"Error sexe\"),IF(VLOOKUP($D$227,Hoja1!$K$53:$L$58,2,0)<VLOOKUP(E235,Hoja1!$K$60:$L$70,2,0),\"Error edat\",\"Correcte\")))))","v":""}]
[]
[]
[null,"Inscripció equip 14",null,null,null,{"$f":"IF(AND(D242=\"\",COUNTBLANK(B246:B250)=5),\"INSCRIPCIÓ EN BLANC\",IF(COUNTBLANK(I246:I250)+COUNTIF(I246:I250,\"Correcte\")<5,\"INSCRIPCIÓ ERRÒNIA\",IF(AND(D242<>\"\",COUNTBLANK(B246:B250)<4),\"INSCRIPCIÓ COMPLETA\",\"INSCRIPCIÓ INCOMPLETA\")))","v":"INSCRIPCIÓ EN BLANC"}]
[]
[null,"Nom per defecte:",null,{"$f":"IF($B$35=\"\",\"\",$B$35&INDEX(Hoja1!$L$72:$L$86,VALUE(RIGHT(B238,2))))","v":""}]
[null,"Nom modificat (opcional):"]
[null,"Categoria:"]
[null,"Rànquing:",null,{"$f":"IF(COUNTBLANK(H246:H250)=5,\"\",MAX(H246:H250)+IF(COUNTBLANK(H246:H250)=4,0,LARGE(H246:H250,2)))","v":""}]
[]
[null,"NP","JUGADOR/A",null,"EDAT","CLUB","SEXE","rk tot","Error?"]
[null,null,{"$f":"IF(COUNTIF(Hoja1!A:A,B246)=1,VLOOKUP(B246,Hoja1!A:F,2,0),\"\")","v":""},null,{"$f":"IF(COUNTIF(Hoja1!A:A,B246)=1,VLOOKUP(B246,Hoja1!A:F,3,0),\"\")","v":""},{"$f":"IF(COUNTIF(Hoja1!A:A,B246)=1,VLOOKUP(B246,Hoja1!A:F,4,0),\"\")","v":""},{"$f":"IF(COUNTIF(Hoja1!A:A,B246)=1,VLOOKUP(B246,Hoja1!A:F,5,0),\"\")","v":""},{"$f":"IF(COUNTIF(Hoja1!A:A,B246)=1,VLOOKUP(B246,Hoja1!A:F,6,0),\"\")","v":""},{"$f":"IF(B246=\"\",\"\",IF(COUNTIF(Hoja1!A:A,B246)=0,\"NP erroni\",IF(COUNTIF(B:B,B246)>1,\"Inscrit/a a + d'1 equip\",IF(VLOOKUP($D$242,Hoja1!$K$53:$L$58,2,0)=0,IF(G246=\"F\",\"Correcte\",\"Error sexe\"),IF(VLOOKUP($D$242,Hoja1!$K$53:$L$58,2,0)<VLOOKUP(E246,Hoja1!$K$60:$L$70,2,0),\"Error edat\",\"Correcte\")))))","v":""}]
[null,null,{"$f":"IF(COUNTIF(Hoja1!A:A,B247)=1,VLOOKUP(B247,Hoja1!A:F,2,0),\"\")","v":""},null,{"$f":"IF(COUNTIF(Hoja1!A:A,B247)=1,VLOOKUP(B247,Hoja1!A:F,3,0),\"\")","v":""},{"$f":"IF(COUNTIF(Hoja1!A:A,B247)=1,VLOOKUP(B247,Hoja1!A:F,4,0),\"\")","v":""},{"$f":"IF(COUNTIF(Hoja1!A:A,B247)=1,VLOOKUP(B247,Hoja1!A:F,5,0),\"\")","v":""},{"$f":"IF(COUNTIF(Hoja1!A:A,B247)=1,VLOOKUP(B247,Hoja1!A:F,6,0),\"\")","v":""},{"$f":"IF(B247=\"\",\"\",IF(COUNTIF(Hoja1!A:A,B247)=0,\"NP erroni\",IF(COUNTIF(B:B,B247)>1,\"Inscrit/a a + d'1 equip\",IF(VLOOKUP($D$242,Hoja1!$K$53:$L$58,2,0)=0,IF(G247=\"F\",\"Correcte\",\"Error sexe\"),IF(VLOOKUP($D$242,Hoja1!$K$53:$L$58,2,0)<VLOOKUP(E247,Hoja1!$K$60:$L$70,2,0),\"Error edat\",\"Correcte\")))))","v":""}]
[null,null,{"$f":"IF(COUNTIF(Hoja1!A:A,B248)=1,VLOOKUP(B248,Hoja1!A:F,2,0),\"\")","v":""},null,{"$f":"IF(COUNTIF(Hoja1!A:A,B248)=1,VLOOKUP(B248,Hoja1!A:F,3,0),\"\")","v":""},{"$f":"IF(COUNTIF(Hoja1!A:A,B248)=1,VLOOKUP(B248,Hoja1!A:F,4,0),\"\")","v":""},{"$f":"IF(COUNTIF(Hoja1!A:A,B248)=1,VLOOKUP(B248,Hoja1!A:F,5,0),\"\")","v":""},{"$f":"IF(COUNTIF(Hoja1!A:A,B248)=1,VLOOKUP(B248,Hoja1!A:F,6,0),\"\")","v":""},{"$f":"IF(B248=\"\",\"\",IF(COUNTIF(Hoja1!A:A,B248)=0,\"NP erroni\",IF(COUNTIF(B:B,B248)>1,\"Inscrit/a a + d'1 equip\",IF(VLOOKUP($D$242,Hoja1!$K$53:$L$58,2,0)=0,IF(G248=\"F\",\"Correcte\",\"Error sexe\"),IF(VLOOKUP($D$242,Hoja1!$K$53:$L$58,2,0)<VLOOKUP(E248,Hoja1!$K$60:$L$70,2,0),\"Error edat\",\"Correcte\")))))","v":""}]
[null,null,{"$f":"IF(COUNTIF(Hoja1!A:A,B249)=1,VLOOKUP(B249,Hoja1!A:F,2,0),\"\")","v":""},null,{"$f":"IF(COUNTIF(Hoja1!A:A,B249)=1,VLOOKUP(B249,Hoja1!A:F,3,0),\"\")","v":""},{"$f":"IF(COUNTIF(Hoja1!A:A,B249)=1,VLOOKUP(B249,Hoja1!A:F,4,0),\"\")","v":""},{"$f":"IF(COUNTIF(Hoja1!A:A,B249)=1,VLOOKUP(B249,Hoja1!A:F,5,0),\"\")","v":""},{"$f":"IF(COUNTIF(Hoja1!A:A,B249)=1,VLOOKUP(B249,Hoja1!A:F,6,0),\"\")","v":""},{"$f":"IF(B249=\"\",\"\",IF(COUNTIF(Hoja1!A:A,B249)=0,\"NP erroni\",IF(COUNTIF(B:B,B249)>1,\"Inscrit/a a + d'1 equip\",IF(VLOOKUP($D$242,Hoja1!$K$53:$L$58,2,0)=0,IF(G249=\"F\",\"Correcte\",\"Error sexe\"),IF(VLOOKUP($D$242,Hoja1!$K$53:$L$58,2,0)<VLOOKUP(E249,Hoja1!$K$60:$L$70,2,0),\"Error edat\",\"Correcte\")))))","v":""}]
[null,null,{"$f":"IF(COUNTIF(Hoja1!A:A,B250)=1,VLOOKUP(B250,Hoja1!A:F,2,0),\"\")","v":""},null,{"$f":"IF(COUNTIF(Hoja1!A:A,B250)=1,VLOOKUP(B250,Hoja1!A:F,3,0),\"\")","v":""},{"$f":"IF(COUNTIF(Hoja1!A:A,B250)=1,VLOOKUP(B250,Hoja1!A:F,4,0),\"\")","v":""},{"$f":"IF(COUNTIF(Hoja1!A:A,B250)=1,VLOOKUP(B250,Hoja1!A:F,5,0),\"\")","v":""},{"$f":"IF(COUNTIF(Hoja1!A:A,B250)=1,VLOOKUP(B250,Hoja1!A:F,6,0),\"\")","v":""},{"$f":"IF(B250=\"\",\"\",IF(COUNTIF(Hoja1!A:A,B250)=0,\"NP erroni\",IF(COUNTIF(B:B,B250)>1,\"Inscrit/a a + d'1 equip\",IF(VLOOKUP($D$242,Hoja1!$K$53:$L$58,2,0)=0,IF(G250=\"F\",\"Correcte\",\"Error sexe\"),IF(VLOOKUP($D$242,Hoja1!$K$53:$L$58,2,0)<VLOOKUP(E250,Hoja1!$K$60:$L$70,2,0),\"Error edat\",\"Correcte\")))))","v":""}]
[]
[]
[null,"Inscripció equip 15",null,null,null,{"$f":"IF(AND(D257=\"\",COUNTBLANK(B261:B265)=5),\"INSCRIPCIÓ EN BLANC\",IF(COUNTBLANK(I261:I265)+COUNTIF(I261:I265,\"Correcte\")<5,\"INSCRIPCIÓ ERRÒNIA\",IF(AND(D257<>\"\",COUNTBLANK(B261:B265)<4),\"INSCRIPCIÓ COMPLETA\",\"INSCRIPCIÓ INCOMPLETA\")))","v":"INSCRIPCIÓ EN BLANC"}]
[]
[null,"Nom per defecte:",null,{"$f":"IF($B$35=\"\",\"\",$B$35&INDEX(Hoja1!$L$72:$L$86,VALUE(RIGHT(B253,2))))","v":""}]
[null,"Nom modificat (opcional):"]
[null,"Categoria:"]
[null,"Rànquing:",null,{"$f":"IF(COUNTBLANK(H261:H265)=5,\"\",MAX(H261:H265)+IF(COUNTBLANK(H261:H265)=4,0,LARGE(H261:H265,2)))","v":""}]
[]
[null,"NP","JUGADOR/A",null,"EDAT","CLUB","SEXE","rk tot","Error?"]
[null,null,{"$f":"IF(COUNTIF(Hoja1!A:A,B261)=1,VLOOKUP(B261,Hoja1!A:F,2,0),\"\")","v":""},null,{"$f":"IF(COUNTIF(Hoja1!A:A,B261)=1,VLOOKUP(B261,Hoja1!A:F,3,0),\"\")","v":""},{"$f":"IF(COUNTIF(Hoja1!A:A,B261)=1,VLOOKUP(B261,Hoja1!A:F,4,0),\"\")","v":""},{"$f":"IF(COUNTIF(Hoja1!A:A,B261)=1,VLOOKUP(B261,Hoja1!A:F,5,0),\"\")","v":""},{"$f":"IF(COUNTIF(Hoja1!A:A,B261)=1,VLOOKUP(B261,Hoja1!A:F,6,0),\"\")","v":""},{"$f":"IF(B261=\"\",\"\",IF(COUNTIF(Hoja1!A:A,B261)=0,\"NP erroni\",IF(COUNTIF(B:B,B261)>1,\"Inscrit/a a + d'1 equip\",IF(VLOOKUP($D$257,Hoja1!$K$53:$L$58,2,0)=0,IF(G261=\"F\",\"Correcte\",\"Error sexe\"),IF(VLOOKUP($D$257,Hoja1!$K$53:$L$58,2,0)<VLOOKUP(E261,Hoja1!$K$60:$L$70,2,0),\"Error edat\",\"Correcte\")))))","v":""}]
[null,null,{"$f":"IF(COUNTIF(Hoja1!A:A,B262)=1,VLOOKUP(B262,Hoja1!A:F,2,0),\"\")","v":""},null,{"$f":"IF(COUNTIF(Hoja1!A:A,B262)=1,VLOOKUP(B262,Hoja1!A:F,3,0),\"\")","v":""},{"$f":"IF(COUNTIF(Hoja1!A:A,B262)=1,VLOOKUP(B262,Hoja1!A:F,4,0),\"\")","v":""},{"$f":"IF(COUNTIF(Hoja1!A:A,B262)=1,VLOOKUP(B262,Hoja1!A:F,5,0),\"\")","v":""},{"$f":"IF(COUNTIF(Hoja1!A:A,B262)=1,VLOOKUP(B262,Hoja1!A:F,6,0),\"\")","v":""},{"$f":"IF(B262=\"\",\"\",IF(COUNTIF(Hoja1!A:A,B262)=0,\"NP erroni\",IF(COUNTIF(B:B,B262)>1,\"Inscrit/a a + d'1 equip\",IF(VLOOKUP($D$257,Hoja1!$K$53:$L$58,2,0)=0,IF(G262=\"F\",\"Correcte\",\"Error sexe\"),IF(VLOOKUP($D$257,Hoja1!$K$53:$L$58,2,0)<VLOOKUP(E262,Hoja1!$K$60:$L$70,2,0),\"Error edat\",\"Correcte\")))))","v":""}]
[null,null,{"$f":"IF(COUNTIF(Hoja1!A:A,B263)=1,VLOOKUP(B263,Hoja1!A:F,2,0),\"\")","v":""},null,{"$f":"IF(COUNTIF(Hoja1!A:A,B263)=1,VLOOKUP(B263,Hoja1!A:F,3,0),\"\")","v":""},{"$f":"IF(COUNTIF(Hoja1!A:A,B263)=1,VLOOKUP(B263,Hoja1!A:F,4,0),\"\")","v":""},{"$f":"IF(COUNTIF(Hoja1!A:A,B263)=1,VLOOKUP(B263,Hoja1!A:F,5,0),\"\")","v":""},{"$f":"IF(COUNTIF(Hoja1!A:A,B263)=1,VLOOKUP(B263,Hoja1!A:F,6,0),\"\")","v":""},{"$f":"IF(B263=\"\",\"\",IF(COUNTIF(Hoja1!A:A,B263)=0,\"NP erroni\",IF(COUNTIF(B:B,B263)>1,\"Inscrit/a a + d'1 equip\",IF(VLOOKUP($D$257,Hoja1!$K$53:$L$58,2,0)=0,IF(G263=\"F\",\"Correcte\",\"Error sexe\"),IF(VLOOKUP($D$257,Hoja1!$K$53:$L$58,2,0)<VLOOKUP(E263,Hoja1!$K$60:$L$70,2,0),\"Error edat\",\"Correcte\")))))","v":""}]
[null,null,{"$f":"IF(COUNTIF(Hoja1!A:A,B264)=1,VLOOKUP(B264,Hoja1!A:F,2,0),\"\")","v":""},null,{"$f":"IF(COUNTIF(Hoja1!A:A,B264)=1,VLOOKUP(B264,Hoja1!A:F,3,0),\"\")","v":""},{"$f":"IF(COUNTIF(Hoja1!A:A,B264)=1,VLOOKUP(B264,Hoja1!A:F,4,0),\"\")","v":""},{"$f":"IF(COUNTIF(Hoja1!A:A,B264)=1,VLOOKUP(B264,Hoja1!A:F,5,0),\"\")","v":""},{"$f":"IF(COUNTIF(Hoja1!A:A,B264)=1,VLOOKUP(B264,Hoja1!A:F,6,0),\"\")","v":""},{"$f":"IF(B264=\"\",\"\",IF(COUNTIF(Hoja1!A:A,B264)=0,\"NP erroni\",IF(COUNTIF(B:B,B264)>1,\"Inscrit/a a + d'1 equip\",IF(VLOOKUP($D$257,Hoja1!$K$53:$L$58,2,0)=0,IF(G264=\"F\",\"Correcte\",\"Error sexe\"),IF(VLOOKUP($D$257,Hoja1!$K$53:$L$58,2,0)<VLOOKUP(E264,Hoja1!$K$60:$L$70,2,0),\"Error edat\",\"Correcte\")))))","v":""}]
[null,null,{"$f":"IF(COUNTIF(Hoja1!A:A,B265)=1,VLOOKUP(B265,Hoja1!A:F,2,0),\"\")","v":""},null,{"$f":"IF(COUNTIF(Hoja1!A:A,B265)=1,VLOOKUP(B265,Hoja1!A:F,3,0),\"\")","v":""},{"$f":"IF(COUNTIF(Hoja1!A:A,B265)=1,VLOOKUP(B265,Hoja1!A:F,4,0),\"\")","v":""},{"$f":"IF(COUNTIF(Hoja1!A:A,B265)=1,VLOOKUP(B265,Hoja1!A:F,5,0),\"\")","v":""},{"$f":"IF(COUNTIF(Hoja1!A:A,B265)=1,VLOOKUP(B265,Hoja1!A:F,6,0),\"\")","v":""},{"$f":"IF(B265=\"\",\"\",IF(COUNTIF(Hoja1!A:A,B265)=0,\"NP erroni\",IF(COUNTIF(B:B,B265)>1,\"Inscrit/a a + d'1 equip\",IF(VLOOKUP($D$257,Hoja1!$K$53:$L$58,2,0)=0,IF(G265=\"F\",\"Correcte\",\"Error sexe\"),IF(VLOOKUP($D$257,Hoja1!$K$53:$L$58,2,0)<VLOOKUP(E265,Hoja1!$K$60:$L$70,2,0),\"Error edat\",\"Correcte\")))))","v":""}]

{"sheet":"Hoja3","index":2,"n_rows":16,"n_cols":10,"rows_kept":16,"cut":false,"hidden":true,"merged":[]}
[]
[{"$f":"IF(Hoja1!AA5>Hoja1!B$582,\"\",Hoja1!AA5)","v":""},{"$f":"IF(Hoja1!AA5>Hoja1!B$582,\"\",Hoja2!$B$35)","v":""},{"$f":"IF($A2>Hoja1!$B$582,\"\",IF(VLOOKUP($A2,Hoja1!$B$584:$K$598,Hoja1!D$582,0)=\"\",\"\",VLOOKUP($A2,Hoja1!$B$584:$K$598,Hoja1!D$582,0)))","v":""},{"$f":"IF($A2>Hoja1!$B$582,\"\",IF(VLOOKUP($A2,Hoja1!$B$584:$K$598,Hoja1!E$582,0)=\"\",\"\",VLOOKUP($A2,Hoja1!$B$584:$K$598,Hoja1!E$582,0)))","v":""},{"$f":"IF($A2>Hoja1!$B$582,\"\",IF(VLOOKUP($A2,Hoja1!$B$584:$K$598,Hoja1!F$582,0)=\"\",\"\",VLOOKUP($A2,Hoja1!$B$584:$K$598,Hoja1!F$582,0)))","v":""},{"$f":"IF($A2>Hoja1!$B$582,\"\",IF(VLOOKUP($A2,Hoja1!$B$584:$K$598,Hoja1!G$582,0)=\"\",\"\",VLOOKUP($A2,Hoja1!$B$584:$K$598,Hoja1!G$582,0)))","v":""},{"$f":"IF($A2>Hoja1!$B$582,\"\",IF(VLOOKUP($A2,Hoja1!$B$584:$K$598,Hoja1!H$582,0)=\"\",\"\",VLOOKUP($A2,Hoja1!$B$584:$K$598,Hoja1!H$582,0)))","v":""},{"$f":"IF($A2>Hoja1!$B$582,\"\",IF(VLOOKUP($A2,Hoja1!$B$584:$K$598,Hoja1!I$582,0)=\"\",\"\",VLOOKUP($A2,Hoja1!$B$584:$K$598,Hoja1!I$582,0)))","v":""},{"$f":"IF($A2>Hoja1!$B$582,\"\",IF(VLOOKUP($A2,Hoja1!$B$584:$K$598,Hoja1!J$582,0)=\"\",\"\",VLOOKUP($A2,Hoja1!$B$584:$K$598,Hoja1!J$582,0)))","v":""},{"$f":"IF($A2>Hoja1!$B$582,\"\",IF(VLOOKUP($A2,Hoja1!$B$584:$K$598,Hoja1!K$582,0)=\"\",\"\",VLOOKUP($A2,Hoja1!$B$584:$K$598,Hoja1!K$582,0)))","v":""}]
[{"$f":"IF(Hoja1!AA6>Hoja1!B$582,\"\",Hoja1!AA6)","v":""},{"$f":"IF(Hoja1!AA6>Hoja1!B$582,\"\",Hoja2!$B$35)","v":""},{"$f":"IF($A3>Hoja1!$B$582,\"\",IF(VLOOKUP($A3,Hoja1!$B$584:$K$598,Hoja1!D$582,0)=\"\",\"\",VLOOKUP($A3,Hoja1!$B$584:$K$598,Hoja1!D$582,0)))","v":""},{"$f":"IF($A3>Hoja1!$B$582,\"\",IF(VLOOKUP($A3,Hoja1!$B$584:$K$598,Hoja1!E$582,0)=\"\",\"\",VLOOKUP($A3,Hoja1!$B$584:$K$598,Hoja1!E$582,0)))","v":""},{"$f":"IF($A3>Hoja1!$B$582,\"\",IF(VLOOKUP($A3,Hoja1!$B$584:$K$598,Hoja1!F$582,0)=\"\",\"\",VLOOKUP($A3,Hoja1!$B$584:$K$598,Hoja1!F$582,0)))","v":""},{"$f":"IF($A3>Hoja1!$B$582,\"\",IF(VLOOKUP($A3,Hoja1!$B$584:$K$598,Hoja1!G$582,0)=\"\",\"\",VLOOKUP($A3,Hoja1!$B$584:$K$598,Hoja1!G$582,0)))","v":""},{"$f":"IF($A3>Hoja1!$B$582,\"\",IF(VLOOKUP($A3,Hoja1!$B$584:$K$598,Hoja1!H$582,0)=\"\",\"\",VLOOKUP($A3,Hoja1!$B$584:$K$598,Hoja1!H$582,0)))","v":""},{"$f":"IF($A3>Hoja1!$B$582,\"\",IF(VLOOKUP($A3,Hoja1!$B$584:$K$598,Hoja1!I$582,0)=\"\",\"\",VLOOKUP($A3,Hoja1!$B$584:$K$598,Hoja1!I$582,0)))","v":""},{"$f":"IF($A3>Hoja1!$B$582,\"\",IF(VLOOKUP($A3,Hoja1!$B$584:$K$598,Hoja1!J$582,0)=\"\",\"\",VLOOKUP($A3,Hoja1!$B$584:$K$598,Hoja1!J$582,0)))","v":""},{"$f":"IF($A3>Hoja1!$B$582,\"\",IF(VLOOKUP($A3,Hoja1!$B$584:$K$598,Hoja1!K$582,0)=\"\",\"\",VLOOKUP($A3,Hoja1!$B$584:$K$598,Hoja1!K$582,0)))","v":""}]
[{"$f":"IF(Hoja1!AA7>Hoja1!B$582,\"\",Hoja1!AA7)","v":""},{"$f":"IF(Hoja1!AA7>Hoja1!B$582,\"\",Hoja2!$B$35)","v":""},{"$f":"IF($A4>Hoja1!$B$582,\"\",IF(VLOOKUP($A4,Hoja1!$B$584:$K$598,Hoja1!D$582,0)=\"\",\"\",VLOOKUP($A4,Hoja1!$B$584:$K$598,Hoja1!D$582,0)))","v":""},{"$f":"IF($A4>Hoja1!$B$582,\"\",IF(VLOOKUP($A4,Hoja1!$B$584:$K$598,Hoja1!E$582,0)=\"\",\"\",VLOOKUP($A4,Hoja1!$B$584:$K$598,Hoja1!E$582,0)))","v":""},{"$f":"IF($A4>Hoja1!$B$582,\"\",IF(VLOOKUP($A4,Hoja1!$B$584:$K$598,Hoja1!F$582,0)=\"\",\"\",VLOOKUP($A4,Hoja1!$B$584:$K$598,Hoja1!F$582,0)))","v":""},{"$f":"IF($A4>Hoja1!$B$582,\"\",IF(VLOOKUP($A4,Hoja1!$B$584:$K$598,Hoja1!G$582,0)=\"\",\"\",VLOOKUP($A4,Hoja1!$B$584:$K$598,Hoja1!G$582,0)))","v":""},{"$f":"IF($A4>Hoja1!$B$582,\"\",IF(VLOOKUP($A4,Hoja1!$B$584:$K$598,Hoja1!H$582,0)=\"\",\"\",VLOOKUP($A4,Hoja1!$B$584:$K$598,Hoja1!H$582,0)))","v":""},{"$f":"IF($A4>Hoja1!$B$582,\"\",IF(VLOOKUP($A4,Hoja1!$B$584:$K$598,Hoja1!I$582,0)=\"\",\"\",VLOOKUP($A4,Hoja1!$B$584:$K$598,Hoja1!I$582,0)))","v":""},{"$f":"IF($A4>Hoja1!$B$582,\"\",IF(VLOOKUP($A4,Hoja1!$B$584:$K$598,Hoja1!J$582,0)=\"\",\"\",VLOOKUP($A4,Hoja1!$B$584:$K$598,Hoja1!J$582,0)))","v":""},{"$f":"IF($A4>Hoja1!$B$582,\"\",IF(VLOOKUP($A4,Hoja1!$B$584:$K$598,Hoja1!K$582,0)=\"\",\"\",VLOOKUP($A4,Hoja1!$B$584:$K$598,Hoja1!K$582,0)))","v":""}]
[{"$f":"IF(Hoja1!AA8>Hoja1!B$582,\"\",Hoja1!AA8)","v":""},{"$f":"IF(Hoja1!AA8>Hoja1!B$582,\"\",Hoja2!$B$35)","v":""},{"$f":"IF($A5>Hoja1!$B$582,\"\",IF(VLOOKUP($A5,Hoja1!$B$584:$K$598,Hoja1!D$582,0)=\"\",\"\",VLOOKUP($A5,Hoja1!$B$584:$K$598,Hoja1!D$582,0)))","v":""},{"$f":"IF($A5>Hoja1!$B$582,\"\",IF(VLOOKUP($A5,Hoja1!$B$584:$K$598,Hoja1!E$582,0)=\"\",\"\",VLOOKUP($A5,Hoja1!$B$584:$K$598,Hoja1!E$582,0)))","v":""},{"$f":"IF($A5>Hoja1!$B$582,\"\",IF(VLOOKUP($A5,Hoja1!$B$584:$K$598,Hoja1!F$582,0)=\"\",\"\",VLOOKUP($A5,Hoja1!$B$584:$K$598,Hoja1!F$582,0)))","v":""},{"$f":"IF($A5>Hoja1!$B$582,\"\",IF(VLOOKUP($A5,Hoja1!$B$584:$K$598,Hoja1!G$582,0)=\"\",\"\",VLOOKUP($A5,Hoja1!$B$584:$K$598,Hoja1!G$582,0)))","v":""},{"$f":"IF($A5>Hoja1!$B$582,\"\",IF(VLOOKUP($A5,Hoja1!$B$584:$K$598,Hoja1!H$582,0)=\"\",\"\",VLOOKUP($A5,Hoja1!$B$584:$K$598,Hoja1!H$582,0)))","v":""},{"$f":"IF($A5>Hoja1!$B$582,\"\",IF(VLOOKUP($A5,Hoja1!$B$584:$K$598,Hoja1!I$582,0)=\"\",\"\",VLOOKUP($A5,Hoja1!$B$584:$K$598,Hoja1!I$582,0)))","v":""},{"$f":"IF($A5>Hoja1!$B$582,\"\",IF(VLOOKUP($A5,Hoja1!$B$584:$K$598,Hoja1!J$582,0)=\"\",\"\",VLOOKUP($A5,Hoja1!$B$584:$K$598,Hoja1!J$582,0)))","v":""},{"$f":"IF($A5>Hoja1!$B$582,\"\",IF(VLOOKUP($A5,Hoja1!$B$584:$K$598,Hoja1!K$582,0)=\"\",\"\",VLOOKUP($A5,Hoja1!$B$584:$K$598,Hoja1!K$582,0)))","v":""}]
[{"$f":"IF(Hoja1!AA9>Hoja1!B$582,\"\",Hoja1!AA9)","v":""},{"$f":"IF(Hoja1!AA9>Hoja1!B$582,\"\",Hoja2!$B$35)","v":""},{"$f":"IF($A6>Hoja1!$B$582,\"\",IF(VLOOKUP($A6,Hoja1!$B$584:$K$598,Hoja1!D$582,0)=\"\",\"\",VLOOKUP($A6,Hoja1!$B$584:$K$598,Hoja1!D$582,0)))","v":""},{"$f":"IF($A6>Hoja1!$B$582,\"\",IF(VLOOKUP($A6,Hoja1!$B$584:$K$598,Hoja1!E$582,0)=\"\",\"\",VLOOKUP($A6,Hoja1!$B$584:$K$598,Hoja1!E$582,0)))","v":""},{"$f":"IF($A6>Hoja1!$B$582,\"\",IF(VLOOKUP($A6,Hoja1!$B$584:$K$598,Hoja1!F$582,0)=\"\",\"\",VLOOKUP($A6,Hoja1!$B$584:$K$598,Hoja1!F$582,0)))","v":""},{"$f":"IF($A6>Hoja1!$B$582,\"\",IF(VLOOKUP($A6,Hoja1!$B$584:$K$598,Hoja1!G$582,0)=\"\",\"\",VLOOKUP($A6,Hoja1!$B$584:$K$598,Hoja1!G$582,0)))","v":""},{"$f":"IF($A6>Hoja1!$B$582,\"\",IF(VLOOKUP($A6,Hoja1!$B$584:$K$598,Hoja1!H$582,0)=\"\",\"\",VLOOKUP($A6,Hoja1!$B$584:$K$598,Hoja1!H$582,0)))","v":""},{"$f":"IF($A6>Hoja1!$B$582,\"\",IF(VLOOKUP($A6,Hoja1!$B$584:$K$598,Hoja1!I$582,0)=\"\",\"\",VLOOKUP($A6,Hoja1!$B$584:$K$598,Hoja1!I$582,0)))","v":""},{"$f":"IF($A6>Hoja1!$B$582,\"\",IF(VLOOKUP($A6,Hoja1!$B$584:$K$598,Hoja1!J$582,0)=\"\",\"\",VLOOKUP($A6,Hoja1!$B$584:$K$598,Hoja1!J$582,0)))","v":""},{"$f":"IF($A6>Hoja1!$B$582,\"\",IF(VLOOKUP($A6,Hoja1!$B$584:$K$598,Hoja1!K$582,0)=\"\",\"\",VLOOKUP($A6,Hoja1!$B$584:$K$598,Hoja1!K$582,0)))","v":""}]
[{"$f":"IF(Hoja1!AA10>Hoja1!B$582,\"\",Hoja1!AA10)","v":""},{"$f":"IF(Hoja1!AA10>Hoja1!B$582,\"\",Hoja2!$B$35)","v":""},{"$f":"IF($A7>Hoja1!$B$582,\"\",IF(VLOOKUP($A7,Hoja1!$B$584:$K$598,Hoja1!D$582,0)=\"\",\"\",VLOOKUP($A7,Hoja1!$B$584:$K$598,Hoja1!D$582,0)))","v":""},{"$f":"IF($A7>Hoja1!$B$582,\"\",IF(VLOOKUP($A7,Hoja1!$B$584:$K$598,Hoja1!E$582,0)=\"\",\"\",VLOOKUP($A7,Hoja1!$B$584:$K$598,Hoja1!E$582,0)))","v":""},{"$f":"IF($A7>Hoja1!$B$582,\"\",IF(VLOOKUP($A7,Hoja1!$B$584:$K$598,Hoja1!F$582,0)=\"\",\"\",VLOOKUP($A7,Hoja1!$B$584:$K$598,Hoja1!F$582,0)))","v":""},{"$f":"IF($A7>Hoja1!$B$582,\"\",IF(VLOOKUP($A7,Hoja1!$B$584:$K$598,Hoja1!G$582,0)=\"\",\"\",VLOOKUP($A7,Hoja1!$B$584:$K$598,Hoja1!G$582,0)))","v":""},{"$f":"IF($A7>Hoja1!$B$582,\"\",IF(VLOOKUP($A7,Hoja1!$B$584:$K$598,Hoja1!H$582,0)=\"\",\"\",VLOOKUP($A7,Hoja1!$B$584:$K$598,Hoja1!H$582,0)))","v":""},{"$f":"IF($A7>Hoja1!$B$582,\"\",IF(VLOOKUP($A7,Hoja1!$B$584:$K$598,Hoja1!I$582,0)=\"\",\"\",VLOOKUP($A7,Hoja1!$B$584:$K$598,Hoja1!I$582,0)))","v":""},{"$f":"IF($A7>Hoja1!$B$582,\"\",IF(VLOOKUP($A7,Hoja1!$B$584:$K$598,Hoja1!J$582,0)=\"\",\"\",VLOOKUP($A7,Hoja1!$B$584:$K$598,Hoja1!J$582,0)))","v":""},{"$f":"IF($A7>Hoja1!$B$582,\"\",IF(VLOOKUP($A7,Hoja1!$B$584:$K$598,Hoja1!K$582,0)=\"\",\"\",VLOOKUP($A7,Hoja1!$B$584:$K$598,Hoja1!K$582,0)))","v":""}]
[{"$f":"IF(Hoja1!AA11>Hoja1!B$582,\"\",Hoja1!AA11)","v":""},{"$f":"IF(Hoja1!AA11>Hoja1!B$582,\"\",Hoja2!$B$35)","v":""},{"$f":"IF($A8>Hoja1!$B$582,\"\",IF(VLOOKUP($A8,Hoja1!$B$584:$K$598,Hoja1!D$582,0)=\"\",\"\",VLOOKUP($A8,Hoja1!$B$584:$K$598,Hoja1!D$582,0)))","v":""},{"$f":"IF($A8>Hoja1!$B$582,\"\",IF(VLOOKUP($A8,Hoja1!$B$584:$K$598,Hoja1!E$582,0)=\"\",\"\",VLOOKUP($A8,Hoja1!$B$584:$K$598,Hoja1!E$582,0)))","v":""},{"$f":"IF($A8>Hoja1!$B$582,\"\",IF(VLOOKUP($A8,Hoja1!$B$584:$K$598,Hoja1!F$582,0)=\"\",\"\",VLOOKUP($A8,Hoja1!$B$584:$K$598,Hoja1!F$582,0)))","v":""},{"$f":"IF($A8>Hoja1!$B$582,\"\",IF(VLOOKUP($A8,Hoja1!$B$584:$K$598,Hoja1!G$582,0)=\"\",\"\",VLOOKUP($A8,Hoja1!$B$584:$K$598,Hoja1!G$582,0)))","v":""},{"$f":"IF($A8>Hoja1!$B$582,\"\",IF(VLOOKUP($A8,Hoja1!$B$584:$K$598,Hoja1!H$582,0)=\"\",\"\",VLOOKUP($A8,Hoja1!$B$584:$K$598,Hoja1!H$582,0)))","v":""},{"$f":"IF($A8>Hoja1!$B$582,\"\",IF(VLOOKUP($A8,Hoja1!$B$584:$K$598,Hoja1!I$582,0)=\"\",\"\",VLOOKUP($A8,Hoja1!$B$584:$K$598,Hoja1!I$582,0)))","v":""},{"$f":"IF($A8>Hoja1!$B$582,\"\",IF(VLOOKUP($A8,Hoja1!$B$584:$K$598,Hoja1!J$582,0)=\"\",\"\",VLOOKUP($A8,Hoja1!$B$584:$K$598,Hoja1!J$582,0)))","v":""},{"$f":"IF($A8>Hoja1!$B$582,\"\",IF(VLOOKUP($A8,Hoja1!$B$584:$K$598,Hoja1!K$582,0)=\"\",\"\",VLOOKUP($A8,Hoja1!$B$584:$K$598,Hoja1!K$582,0)))","v":""}]
[{"$f":"IF(Hoja1!AA12>Hoja1!B$582,\"\",Hoja1!AA12)","v":""},{"$f":"IF(Hoja1!AA12>Hoja1!B$582,\"\",Hoja2!$B$35)","v":""},{"$f":"IF($A9>Hoja1!$B$582,\"\",IF(VLOOKUP($A9,Hoja1!$B$584:$K$598,Hoja1!D$582,0)=\"\",\"\",VLOOKUP($A9,Hoja1!$B$584:$K$598,Hoja1!D$582,0)))","v":""},{"$f":"IF($A9>Hoja1!$B$582,\"\",IF(VLOOKUP($A9,Hoja1!$B$584:$K$598,Hoja1!E$582,0)=\"\",\"\",VLOOKUP($A9,Hoja1!$B$584:$K$598,Hoja1!E$582,0)))","v":""},{"$f":"IF($A9>Hoja1!$B$582,\"\",IF(VLOOKUP($A9,Hoja1!$B$584:$K$598,Hoja1!F$582,0)=\"\",\"\",VLOOKUP($A9,Hoja1!$B$584:$K$598,Hoja1!F$582,0)))","v":""},{"$f":"IF($A9>Hoja1!$B$582,\"\",IF(VLOOKUP($A9,Hoja1!$B$584:$K$598,Hoja1!G$582,0)=\"\",\"\",VLOOKUP($A9,Hoja1!$B$584:$K$598,Hoja1!G$582,0)))","v":""},{"$f":"IF($A9>Hoja1!$B$582,\"\",IF(VLOOKUP($A9,Hoja1!$B$584:$K$598,Hoja1!H$582,0)=\"\",\"\",VLOOKUP($A9,Hoja1!$B$584:$K$598,Hoja1!H$582,0)))","v":""},{"$f":"IF($A9>Hoja1!$B$582,\"\",IF(VLOOKUP($A9,Hoja1!$B$584:$K$598,Hoja1!I$582,0)=\"\",\"\",VLOOKUP($A9,Hoja1!$B$584:$K$598,Hoja1!I$582,0)))","v":""},{"$f":"IF($A9>Hoja1!$B$582,\"\",IF(VLOOKUP($A9,Hoja1!$B$584:$K$598,Hoja1!J$582,0)=\"\",\"\",VLOOKUP($A9,Hoja1!$B$584:$K$598,Hoja1!J$582,0)))","v":""},{"$f":"IF($A9>Hoja1!$B$582,\"\",IF(VLOOKUP($A9,Hoja1!$B$584:$K$598,Hoja1!K$582,0)=\"\",\"\",VLOOKUP($A9,Hoja1!$B$584:$K$598,Hoja1!K$582,0)))","v":""}]
[{"$f":"IF(Hoja1!AA13>Hoja1!B$582,\"\",Hoja1!AA13)","v":""},{"$f":"IF(Hoja1!AA13>Hoja1!B$582,\"\",Hoja2!$B$35)","v":""},{"$f":"IF($A10>Hoja1!$B$582,\"\",IF(VLOOKUP($A10,Hoja1!$B$584:$K$598,Hoja1!D$582,0)=\"\",\"\",VLOOKUP($A10,Hoja1!$B$584:$K$598,Hoja1!D$582,0)))","v":""},{"$f":"IF($A10>Hoja1!$B$582,\"\",IF(VLOOKUP($A10,Hoja1!$B$584:$K$598,Hoja1!E$582,0)=\"\",\"\",VLOOKUP($A10,Hoja1!$B$584:$K$598,Hoja1!E$582,0)))","v":""},{"$f":"IF($A10>Hoja1!$B$582,\"\",IF(VLOOKUP($A10,Hoja1!$B$584:$K$598,Hoja1!F$582,0)=\"\",\"\",VLOOKUP($A10,Hoja1!$B$584:$K$598,Hoja1!F$582,0)))","v":""},{"$f":"IF($A10>Hoja1!$B$582,\"\",IF(VLOOKUP($A10,Hoja1!$B$584:$K$598,Hoja1!G$582,0)=\"\",\"\",VLOOKUP($A10,Hoja1!$B$584:$K$598,Hoja1!G$582,0)))","v":""},{"$f":"IF($A10>Hoja1!$B$582,\"\",IF(VLOOKUP($A10,Hoja1!$B$584:$K$598,Hoja1!H$582,0)=\"\",\"\",VLOOKUP($A10,Hoja1!$B$584:$K$598,Hoja1!H$582,0)))","v":""},{"$f":"IF($A10>Hoja1!$B$582,\"\",IF(VLOOKUP($A10,Hoja1!$B$584:$K$598,Hoja1!I$582,0)=\"\",\"\",VLOOKUP($A10,Hoja1!$B$584:$K$598,Hoja1!I$582,0)))","v":""},{"$f":"IF($A10>Hoja1!$B$582,\"\",IF(VLOOKUP($A10,Hoja1!$B$584:$K$598,Hoja1!J$582,0)=\"\",\"\",VLOOKUP($A10,Hoja1!$B$584:$K$598,Hoja1!J$582,0)))","v":""},{"$f":"IF($A10>Hoja1!$B$582,\"\",IF(VLOOKUP($A10,Hoja1!$B$584:$K$598,Hoja1!K$582,0)=\"\",\"\",VLOOKUP($A10,Hoja1!$B$584:$K$598,Hoja1!K$582,0)))","v":""}]
[{"$f":"IF(Hoja1!AA14>Hoja1!B$582,\"\",Hoja1!AA14)","v":""},{"$f":"IF(Hoja1!AA14>Hoja1!B$582,\"\",Hoja2!$B$35)","v":""},{"$f":"IF($A11>Hoja1!$B$582,\"\",IF(VLOOKUP($A11,Hoja1!$B$584:$K$598,Hoja1!D$582,0)=\"\",\"\",VLOOKUP($A11,Hoja1!$B$584:$K$598,Hoja1!D$582,0)))","v":""},{"$f":"IF($A11>Hoja1!$B$582,\"\",IF(VLOOKUP($A11,Hoja1!$B$584:$K$598,Hoja1!E$582,0)=\"\",\"\",VLOOKUP($A11,Hoja1!$B$584:$K$598,Hoja1!E$582,0)))","v":""},{"$f":"IF($A11>Hoja1!$B$582,\"\",IF(VLOOKUP($A11,Hoja1!$B$584:$K$598,Hoja1!F$582,0)=\"\",\"\",VLOOKUP($A11,Hoja1!$B$584:$K$598,Hoja1!F$582,0)))","v":""},{"$f":"IF($A11>Hoja1!$B$582,\"\",IF(VLOOKUP($A11,Hoja1!$B$584:$K$598,Hoja1!G$582,0)=\"\",\"\",VLOOKUP($A11,Hoja1!$B$584:$K$598,Hoja1!G$582,0)))","v":""},{"$f":"IF($A11>Hoja1!$B$582,\"\",IF(VLOOKUP($A11,Hoja1!$B$584:$K$598,Hoja1!H$582,0)=\"\",\"\",VLOOKUP($A11,Hoja1!$B$584:$K$598,Hoja1!H$582,0)))","v":""},{"$f":"IF($A11>Hoja1!$B$582,\"\",IF(VLOOKUP($A11,Hoja1!$B$584:$K$598,Hoja1!I$582,0)=\"\",\"\",VLOOKUP($A11,Hoja1!$B$584:$K$598,Hoja1!I$582,0)))","v":""},{"$f":"IF($A11>Hoja1!$B$582,\"\",IF(VLOOKUP($A11,Hoja1!$B$584:$K$598,Hoja1!J$582,0)=\"\",\"\",VLOOKUP($A11,Hoja1!$B$584:$K$598,Hoja1!J$582,0)))","v":""},{"$f":"IF($A11>Hoja1!$B$582,\"\",IF(VLOOKUP($A11,Hoja1!$B$584:$K$598,Hoja1!K$582,0)=\"\",\"\",VLOOKUP($A11,Hoja1!$B$584:$K$598,Hoja1!K$582,0)))","v":""}]
[{"$f":"IF(Hoja1!AA15>Hoja1!B$582,\"\",Hoja1!AA15)","v":""},{"$f":"IF(Hoja1!AA15>Hoja1!B$582,\"\",Hoja2!$B$35)","v":""},{"$f":"IF($A12>Hoja1!$B$582,\"\",IF(VLOOKUP($A12,Hoja1!$B$584:$K$598,Hoja1!D$582,0)=\"\",\"\",VLOOKUP($A12,Hoja1!$B$584:$K$598,Hoja1!D$582,0)))","v":""},{"$f":"IF($A12>Hoja1!$B$582,\"\",IF(VLOOKUP($A12,Hoja1!$B$584:$K$598,Hoja1!E$582,0)=\"\",\"\",VLOOKUP($A12,Hoja1!$B$584:$K$598,Hoja1!E$582,0)))","v":""},{"$f":"IF($A12>Hoja1!$B$582,\"\",IF(VLOOKUP($A12,Hoja1!$B$584:$K$598,Hoja1!F$582,0)=\"\",\"\",VLOOKUP($A12,Hoja1!$B$584:$K$598,Hoja1!F$582,0)))","v":""},{"$f":"IF($A12>Hoja1!$B$582,\"\",IF(VLOOKUP($A12,Hoja1!$B$584:$K$598,Hoja1!G$582,0)=\"\",\"\",VLOOKUP($A12,Hoja1!$B$584:$K$598,Hoja1!G$582,0)))","v":""},{"$f":"IF($A12>Hoja1!$B$582,\"\",IF(VLOOKUP($A12,Hoja1!$B$584:$K$598,Hoja1!H$582,0)=\"\",\"\",VLOOKUP($A12,Hoja1!$B$584:$K$598,Hoja1!H$582,0)))","v":""},{"$f":"IF($A12>Hoja1!$B$582,\"\",IF(VLOOKUP($A12,Hoja1!$B$584:$K$598,Hoja1!I$582,0)=\"\",\"\",VLOOKUP($A12,Hoja1!$B$584:$K$598,Hoja1!I$582,0)))","v":""},{"$f":"IF($A12>Hoja1!$B$582,\"\",IF(VLOOKUP($A12,Hoja1!$B$584:$K$598,Hoja1!J$582,0)=\"\",\"\",VLOOKUP($A12,Hoja1!$B$584:$K$598,Hoja1!J$582,0)))","v":""},{"$f":"IF($A12>Hoja1!$B$582,\"\",IF(VLOOKUP($A12,Hoja1!$B$584:$K$598,Hoja1!K$582,0)=\"\",\"\",VLOOKUP($A12,Hoja1!$B$584:$K$598,Hoja1!K$582,0)))","v":""}]
[{"$f":"IF(Hoja1!AA16>Hoja1!B$582,\"\",Hoja1!AA16)","v":""},{"$f":"IF(Hoja1!AA16>Hoja1!B$582,\"\",Hoja2!$B$35)","v":""},{"$f":"IF($A13>Hoja1!$B$582,\"\",IF(VLOOKUP($A13,Hoja1!$B$584:$K$598,Hoja1!D$582,0)=\"\",\"\",VLOOKUP($A13,Hoja1!$B$584:$K$598,Hoja1!D$582,0)))","v":""},{"$f":"IF($A13>Hoja1!$B$582,\"\",IF(VLOOKUP($A13,Hoja1!$B$584:$K$598,Hoja1!E$582,0)=\"\",\"\",VLOOKUP($A13,Hoja1!$B$584:$K$598,Hoja1!E$582,0)))","v":""},{"$f":"IF($A13>Hoja1!$B$582,\"\",IF(VLOOKUP($A13,Hoja1!$B$584:$K$598,Hoja1!F$582,0)=\"\",\"\",VLOOKUP($A13,Hoja1!$B$584:$K$598,Hoja1!F$582,0)))","v":""},{"$f":"IF($A13>Hoja1!$B$582,\"\",IF(VLOOKUP($A13,Hoja1!$B$584:$K$598,Hoja1!G$582,0)=\"\",\"\",VLOOKUP($A13,Hoja1!$B$584:$K$598,Hoja1!G$582,0)))","v":""},{"$f":"IF($A13>Hoja1!$B$582,\"\",IF(VLOOKUP($A13,Hoja1!$B$584:$K$598,Hoja1!H$582,0)=\"\",\"\",VLOOKUP($A13,Hoja1!$B$584:$K$598,Hoja1!H$582,0)))","v":""},{"$f":"IF($A13>Hoja1!$B$582,\"\",IF(VLOOKUP($A13,Hoja1!$B$584:$K$598,Hoja1!I$582,0)=\"\",\"\",VLOOKUP($A13,Hoja1!$B$584:$K$598,Hoja1!I$582,0)))","v":""},{"$f":"IF($A13>Hoja1!$B$582,\"\",IF(VLOOKUP($A13,Hoja1!$B$584:$K$598,Hoja1!J$582,0)=\"\",\"\",VLOOKUP($A13,Hoja1!$B$584:$K$598,Hoja1!J$582,0)))","v":""},{"$f":"IF($A13>Hoja1!$B$582,\"\",IF(VLOOKUP($A13,Hoja1!$B$584:$K$598,Hoja1!K$582,0)=\"\",\"\",VLOOKUP($A13,Hoja1!$B$584:$K$598,Hoja1!K$582,0)))","v":""}]
[{"$f":"IF(Hoja1!AA17>Hoja1!B$582,\"\",Hoja1!AA17)","v":""},{"$f":"IF(Hoja1!AA17>Hoja1!B$582,\"\",Hoja2!$B$35)","v":""},{"$f":"IF($A14>Hoja1!$B$582,\"\",IF(VLOOKUP($A14,Hoja1!$B$584:$K$598,Hoja1!D$582,0)=\"\",\"\",VLOOKUP($A14,Hoja1!$B$584:$K$598,Hoja1!D$582,0)))","v":""},{"$f":"IF($A14>Hoja1!$B$582,\"\",IF(VLOOKUP($A14,Hoja1!$B$584:$K$598,Hoja1!E$582,0)=\"\",\"\",VLOOKUP($A14,Hoja1!$B$584:$K$598,Hoja1!E$582,0)))","v":""},{"$f":"IF($A14>Hoja1!$B$582,\"\",IF(VLOOKUP($A14,Hoja1!$B$584:$K$598,Hoja1!F$582,0)=\"\",\"\",VLOOKUP($A14,Hoja1!$B$584:$K$598,Hoja1!F$582,0)))","v":""},{"$f":"IF($A14>Hoja1!$B$582,\"\",IF(VLOOKUP($A14,Hoja1!$B$584:$K$598,Hoja1!G$582,0)=\"\",\"\",VLOOKUP($A14,Hoja1!$B$584:$K$598,Hoja1!G$582,0)))","v":""},{"$f":"IF($A14>Hoja1!$B$582,\"\",IF(VLOOKUP($A14,Hoja1!$B$584:$K$598,Hoja1!H$582,0)=\"\",\"\",VLOOKUP($A14,Hoja1!$B$584:$K$598,Hoja1!H$582,0)))","v":""},{"$f":"IF($A14>Hoja1!$B$582,\"\",IF(VLOOKUP($A14,Hoja1!$B$584:$K$598,Hoja1!I$582,0)=\"\",\"\",VLOOKUP($A14,Hoja1!$B$584:$K$598,Hoja1!I$582,0)))","v":""},{"$f":"IF($A14>Hoja1!$B$582,\"\",IF(VLOOKUP($A14,Hoja1!$B$584:$K$598,Hoja1!J$582,0)=\"\",\"\",VLOOKUP($A14,Hoja1!$B$584:$K$598,Hoja1!J$582,0)))","v":""},{"$f":"IF($A14>Hoja1!$B$582,\"\",IF(VLOOKUP($A14,Hoja1!$B$584:$K$598,Hoja1!K$582,0)=\"\",\"\",VLOOKUP($A14,Hoja1!$B$584:$K$598,Hoja1!K$582,0)))","v":""}]
[{"$f":"IF(Hoja1!AA18>Hoja1!B$582,\"\",Hoja1!AA18)","v":""},{"$f":"IF(Hoja1!AA18>Hoja1!B$582,\"\",Hoja2!$B$35)","v":""},{"$f":"IF($A15>Hoja1!$B$582,\"\",IF(VLOOKUP($A15,Hoja1!$B$584:$K$598,Hoja1!D$582,0)=\"\",\"\",VLOOKUP($A15,Hoja1!$B$584:$K$598,Hoja1!D$582,0)))","v":""},{"$f":"IF($A15>Hoja1!$B$582,\"\",IF(VLOOKUP($A15,Hoja1!$B$584:$K$598,Hoja1!E$582,0)=\"\",\"\",VLOOKUP($A15,Hoja1!$B$584:$K$598,Hoja1!E$582,0)))","v":""},{"$f":"IF($A15>Hoja1!$B$582,\"\",IF(VLOOKUP($A15,Hoja1!$B$584:$K$598,Hoja1!F$582,0)=\"\",\"\",VLOOKUP($A15,Hoja1!$B$584:$K$598,Hoja1!F$582,0)))","v":""},{"$f":"IF($A15>Hoja1!$B$582,\"\",IF(VLOOKUP($A15,Hoja1!$B$584:$K$598,Hoja1!G$582,0)=\"\",\"\",VLOOKUP($A15,Hoja1!$B$584:$K$598,Hoja1!G$582,0)))","v":""},{"$f":"IF($A15>Hoja1!$B$582,\"\",IF(VLOOKUP($A15,Hoja1!$B$584:$K$598,Hoja1!H$582,0)=\"\",\"\",VLOOKUP($A15,Hoja1!$B$584:$K$598,Hoja1!H$582,0)))","v":""},{"$f":"IF($A15>Hoja1!$B$582,\"\",IF(VLOOKUP($A15,Hoja1!$B$584:$K$598,Hoja1!I$582,0)=\"\",\"\",VLOOKUP($A15,Hoja1!$B$584:$K$598,Hoja1!I$582,0)))","v":""},{"$f":"IF($A15>Hoja1!$B$582,\"\",IF(VLOOKUP($A15,Hoja1!$B$584:$K$598,Hoja1!J$582,0)=\"\",\"\",VLOOKUP($A15,Hoja1!$B$584:$K$598,Hoja1!J$582,0)))","v":""},{"$f":"IF($A15>Hoja1!$B$582,\"\",IF(VLOOKUP($A15,Hoja1!$B$584:$K$598,Hoja1!K$582,0)=\"\",\"\",VLOOKUP($A15,Hoja1!$B$584:$K$598,Hoja1!K$582,0)))","v":""}]
[{"$f":"IF(Hoja1!AA19>Hoja1!B$582,\"\",Hoja1!AA19)","v":""},{"$f":"IF(Hoja1!AA19>Hoja1!B$582,\"\",Hoja2!$B$35)","v":""},{"$f":"IF($A16>Hoja1!$B$582,\"\",IF(VLOOKUP($A16,Hoja1!$B$584:$K$598,Hoja1!D$582,0)=\"\",\"\",VLOOKUP($A16,Hoja1!$B$584:$K$598,Hoja1!D$582,0)))","v":""},{"$f":"IF($A16>Hoja1!$B$582,\"\",IF(VLOOKUP($A16,Hoja1!$B$584:$K$598,Hoja1!E$582,0)=\"\",\"\",VLOOKUP($A16,Hoja1!$B$584:$K$598,Hoja1!E$582,0)))","v":""},{"$f":"IF($A16>Hoja1!$B$582,\"\",IF(VLOOKUP($A16,Hoja1!$B$584:$K$598,Hoja1!F$582,0)=\"\",\"\",VLOOKUP($A16,Hoja1!$B$584:$K$598,Hoja1!F$582,0)))","v":""},{"$f":"IF($A16>Hoja1!$B$582,\"\",IF(VLOOKUP($A16,Hoja1!$B$584:$K$598,Hoja1!G$582,0)=\"\",\"\",VLOOKUP($A16,Hoja1!$B$584:$K$598,Hoja1!G$582,0)))","v":""},{"$f":"IF($A16>Hoja1!$B$582,\"\",IF(VLOOKUP($A16,Hoja1!$B$584:$K$598,Hoja1!H$582,0)=\"\",\"\",VLOOKUP($A16,Hoja1!$B$584:$K$598,Hoja1!H$582,0)))","v":""},{"$f":"IF($A16>Hoja1!$B$582,\"\",IF(VLOOKUP($A16,Hoja1!$B$584:$K$598,Hoja1!I$582,0)=\"\",\"\",VLOOKUP($A16,Hoja1!$B$584:$K$598,Hoja1!I$582,0)))","v":""},{"$f":"IF($A16>Hoja1!$B$582,\"\",IF(VLOOKUP($A16,Hoja1!$B$584:$K$598,Hoja1!J$582,0)=\"\",\"\",VLOOKUP($A16,Hoja1!$B$584:$K$598,Hoja1!J$582,0)))","v":""},{"$f":"IF($A16>Hoja1!$B$582,\"\",IF(VLOOKUP($A16,Hoja1!$B$584:$K$598,Hoja1!K$582,0)=\"\",\"\",VLOOKUP($A16,Hoja1!$B$584:$K$598,Hoja1!K$582,0)))","v":""}]